program: Gaussian 09
title: 000253967
version: EM64L-G09RevD.01
frameworkgroup: C1[X(C12H12O2)]
method: RPBEPBE
basis: SDD
operation: Freq
keyword: #pfreq=noraman
keyword: PBEPBE/SDD
title: #p freq=noraman PBEPBE/SDD
converged: YES YES NO NO
title: Mulliken charges:
elementType: O O C C C C C C C C C C C C H H H H H H H H H H H H
charge: -0.194370 -0.200189 -0.266029 -0.633483 0.384728 -0.677769 0.327875 0.175132 0.205871 -0.449599 -0.433481 -0.231263 -0.233726 -0.782945 0.282672 0.260098 0.234481 0.264073 0.248980 0.241145 0.241042 0.229430 0.230420 0.235459 0.289630 0.251816
chargesum: 0.00000
title: Mulliken charges with hydrogens summed into heavy atoms:
elementType: O O C C C C C C C C C C C C
charge: -0.194370 -0.200189 0.016643 -0.138904 0.384728 -0.164716 0.327875 0.175132 0.205871 -0.208453 -0.192439 -0.001833 -0.003306 -0.006040
polarizability: 1.74206719e+02 -1.77777243e+00 1.27462460e+02 3.68921112e+00 4.14454976e+00 8.56787437e+01
1716.lowfreq: -9.3743 -0.0008 -0.0005 -0.0004 3.8385 8.3620 37.0742 65.3880 75.0533
frequency: 36.9087 65.3822 75.0471 146.6017 165.3767 173.3439 218.8498 274.7487 289.6557 337.7383 370.7217 424.4749 441.1886 493.2060 497.1883 513.4996 577.5168 593.8509 603.7358 659.0384 711.7311 737.1586 756.2533 775.8152 831.1096 868.6557 891.3142 908.2780 948.5587 953.4460 963.3998 989.1244 1022.2314 1032.7696 1061.8629 1096.0061 1114.6987 1155.3052 1171.7487 1173.9406 1188.0120 1195.2219 1206.8390 1229.7630 1250.5074 1293.4532 1300.9482 1326.7116 1373.8922 1388.5994 1434.2579 1444.9697 1446.2853 1452.8734 1466.9281 1485.5836 1593.8738 1614.1307 1619.9763 1638.4767 2948.4985 2976.4832 2977.8772 3009.5355 3053.4904 3058.6036 3084.6006 3119.8721 3123.9162 3126.7653 3142.0587 3162.9087
redmass: 4.5898 4.6555 5.5864 4.0209 1.0756 3.7660 6.3137 2.6684 2.8389 4.2751 2.9225 5.1617 3.2630 3.5543 3.2262 4.4193 3.7394 3.4875 4.5651 4.1381 3.9509 3.7685 1.2962 3.0743 4.4855 1.4514 1.7922 2.7663 1.8493 1.4609 2.2547 1.3257 1.9617 2.2244 2.1499 2.1633 1.9096 1.6633 1.5772 1.0895 1.5669 2.2108 1.9182 1.9011 1.4301 1.8056 1.3181 1.5367 1.2553 6.3000 1.1241 1.0533 2.2987 1.0729 1.1529 2.3556 6.8165 7.5931 8.0246 8.4435 1.0670 1.0379 1.0642 1.0827 1.0965 1.0956 1.0932 1.0867 1.1005 1.0891 1.0938 1.1005
irintensity: 3.6812 3.8049 2.3705 1.1891 0.9308 6.4725 4.7584 3.4477 4.2302 0.2282 0.7989 6.5507 11.5552 8.7483 2.6374 9.2101 14.4587 1.6705 1.1116 5.4347 3.9665 1.0713 65.6272 9.6179 11.9801 1.1337 7.3949 6.9580 4.5179 3.2792 5.0520 0.0437 2.1932 5.0645 51.0178 43.3286 45.9752 48.7129 39.8397 8.9543 18.3540 81.1862 47.9297 6.2888 5.0644 5.4222 15.0097 7.5496 91.8273 0.3320 14.8808 22.9088 10.4657 28.8491 22.1822 24.7639 6.1904 114.6754 118.5284 60.7510 8.2893 6.8434 7.6004 7.5402 19.6005 5.1214 7.5608 7.2431 11.0582 2.3945 27.7073 29.6926
temp: 298.150 k
press: 1.00000 atm
elementType: 8 8 6 6 6 6 6 6 6 6 6 6 6 6 1 1 1 1 1 1 1 1 1 1 1 1
symmnumber: 1
zpe: 543447.9 jmol-1
zpe.correction: 0.206988 hartree
zpe.thermalcorrener: 0.219294 hartree
zpe.thermalcorrenthalpy: 0.220238 hartree
zpe.thermalcorrgfe: 0.167866 hartree
zpe.sumelectzpe: -613.921397 hartree
zpe.sumelectthermal: -613.909092 hartree
zpe.sumelectthermalent: -613.908147 hartree
zpe.sumelectthermalfe: -613.960520 hartree
dipole: -1.6894 -0.8081 -1.2487
dipole: 2.2508
quadrupole: -78.4127 -83.7553 -85.1143
quadrupole: -1.5688 -5.1138 8.7889
quadrupole: 4.0147 -1.3279 -2.6868 -1.5688 -5.1138 8.7889
hfenergy: -614.1283854 hartree
pointgroup: C01 [X(C12H12O2)]
dipole: 0.6967884 0.4635199 -0.289517 debye
dipolederiv: -0.5505977 -0.1514692 -0.2499669 0.0081423 -0.6512289 -0.2394739 -0.3120191 -0.3200798 -0.6367815 -0.7497535 0.1079852 0.0861627 0.0115443 -0.2741559 -0.0611058 0.2638745 -0.2188047 -0.873072 -0.7000529 0.4034686 0.1876509 0.4294206 -0.410423 -0.2109399 0.2215932 -0.1231677 -0.0439572 -0.075537 0.0034025 -0.0156684 -0.0173276 0.1408097 -0.0118532 0.1737948 -0.0446826 0.0647867 0.2436378 -0.0992159 -0.0366117 -0.204638 -0.0746341 -0.0143489 -0.1396608 0.0224197 -0.0435718 -0.3463769 -0.0345418 -0.2276565 0.062338 -0.0017105 0.0485797 -0.1984238 0.0986516 -0.0602505 0.204646 0.1460562 0.0115707 0.4064294 0.0380549 0.0600388 -0.0572186 -0.0331722 -0.0537413 0.6646674 -0.0241013 0.465759 -0.5406603 0.9819571 0.3104265 0.5175721 0.3144252 0.6285799 1.4469506 -0.3581252 -0.0794371 -0.0945682 0.0569787 0.0835235 -0.2685654 0.2336833 0.9979511 -0.1310105 0.0201957 -0.0103569 -0.0006564 0.1006984 0.0381098 -0.0014906 0.0395927 -0.1499911 -0.0943501 -0.0402727 -0.0356372 -0.0882003 0.0782415 0.0178516 -0.0233803 0.0353459 -0.1469907 0.0145467 0.0611393 -0.0208152 0.0890287 0.0156554 0.009986 0.0014018 0.0123708 -0.1521664 0.0339645 -0.0472743 -0.0402467 -0.067777 -0.0420485 0.0271759 -0.0187972 0.0239083 -0.1494005 -0.3309761 0.0305384 -0.2281435 0.0571044 -0.0174366 -0.0315831 -0.2509266 -0.0415371 -0.3157581 0.0998696 -0.0284741 -0.0347774 -0.0309398 0.0495708 0.035088 -0.0712666 0.038931 -0.0519937 0.0823774 0.0260017 0.0651533 0.004764 0.0775486 0.0564875 -0.0330001 0.0272152 -0.0228004 0.0379976 -0.0211906 -0.0145088 0.0244129 -0.1307041 -0.0075889 -0.0377102 0.0243862 0.0873454 0.0264835 0.0541739 -0.0022874 0.0211026 -0.0700451 -0.0360989 -0.023477 -0.0704964 0.0845265 -0.0022125 -0.0380407 0.0644417 -0.0082717 0.0937853 -0.0228188 0.0823744 0.0266701 -0.0055139 0.0771925 0.0571585 0.0139627 0.0129685 -0.1042724 -0.0339276 0.0036076 -0.0325728 0.1436107 0.0870019 -0.009532 0.0062705 0.0343035 -0.1036298 -0.0345471 0.0062393 -0.0374558 0.1438587 -0.0656435 -0.1018009 0.0061372 -0.1122082 0.0089316 -0.0079383 0.0058892 -0.0078931 0.1569225 -0.1110349 0.0648673 0.0322753 0.0689297 0.0601693 -0.021535 0.0405909 -0.0219631 0.1550037 0.0772997 -0.0520285 0.002719 -0.0106187 -0.0135647 0.110578 0.0026722 0.0817183 0.0726994 0.1708505 0.0327885 0.0169802 -0.0471684 0.0666559 -0.0685227 0.0252478 -0.0359503 0.1102177 -0.1099401 -0.0017087 0.0370305 -0.0074543 0.1247965 0.0044367 0.0910785 0.0084572 0.0604869 unknown
polarizability: 174.2948566|-2.2856984|124.3785864|1.6866117|11.7339593|88.6744799 unknown
InChI: InChI=1S/C12H12O2/c1-8(13)11-6-9-4-2-3-5-10(9)7-12(11)14/h2-5,11H,6-7H2,1H3
charge 0 multiplicity 1
26 atoms
O  -1.621154 -1.577375 -1.689004
O  -2.971786 0.811675 1.236364
C  -1.285357 0.564354 -0.523823
C  -0.267128 1.204372 0.45419
C  1.149414 0.711812 0.22283
C  0.09991 -1.56545 0.052745
C  1.341124 -0.684668 0.033219
C  -0.994859 -0.936597 -0.807271
C  -2.745817 0.675494 0.006328
C  2.27054 1.572314 0.210643
C  2.637993 -1.20095 -0.178428
C  3.571405 1.053619 0.013871
C  3.755797 -0.33434 -0.18265
C  -3.842135 0.586056 -1.03397
H  -1.255424 1.057616 -1.514847
H  -0.598257 0.960474 1.484411
H  -0.321847 2.304295 0.370085
H  0.296125 -2.58975 -0.302636
H  -0.297936 -1.632453 1.089517
H  2.126736 2.649897 0.355322
H  2.776565 -2.276793 -0.337453
H  4.43474 1.728112 0.007822
H  4.761269 -0.73872 -0.342655
H  -3.817576 1.485111 -1.680313
H  -3.659411 -0.284204 -1.692207
H  -4.82933 0.512198 -0.552994
