program: Gaussian 09
title: 000254009
version: EM64L-G09RevD.01
frameworkgroup: C1[X(C13H8Cl2N2O4)]
method: RPBEPBE
basis: SDD
operation: Freq
keyword: #p
keyword: freq=noraman
keyword: PBEPBE/SDD
title: #p freq=noraman PBEPBE/SDD
converged: YES YES NO NO
title: Mulliken charges:
elementType: Cl Cl O O O O N N C C C C C C C C C C C C C H H H H H H H H
charge: -0.023226 -0.016514 -0.186285 -0.191347 -0.193169 -0.191068 0.010329 0.016813 -0.643343 0.408058 0.439083 0.220908 0.213767 -0.338856 -0.388690 -0.324202 -0.339058 -0.230572 -0.224447 -0.110835 -0.117546 0.255783 0.286971 0.255265 0.257209 0.307838 0.312934 0.265361 0.268840
chargesum: 0.00000
title: Mulliken charges with hydrogens summed into heavy atoms:
elementType: Cl Cl O O O O N N C C C C C C C C C C C C C
charge: -0.023226 -0.016514 -0.186285 -0.191347 -0.193169 -0.191068 0.010329 0.016813 -0.100590 0.408058 0.439083 0.220908 0.213767 -0.083591 -0.131481 -0.016364 -0.026124 0.034789 0.044393 -0.110835 -0.117546
polarizability: 2.74586924e+02 -1.45671308e+01 1.72713485e+02 -2.52033175e+01 -8.98668058e+00 1.45094019e+02
1716.lowfreq: -3.9748 -3.5363 -0.0010 -0.0009 0.0009 3.0601 13.9084 19.2568 32.8014
frequency: 13.7382 18.7977 32.7880 49.8287 63.0525 95.8157 114.2723 146.4347 153.4165 156.8583 176.8072 189.1749 261.2557 296.9205 321.0955 331.2296 357.2334 368.1110 372.9377 386.4265 411.3629 429.0090 443.1619 487.5084 511.1118 534.9778 577.7286 640.4476 644.3497 658.7052 671.3585 683.6672 695.6928 719.4931 731.4120 778.0078 780.8525 822.8232 832.6259 847.1314 862.1487 908.3938 916.9799 923.5467 968.2575 972.3668 1053.9030 1057.8174 1093.8428 1095.3754 1146.1293 1149.0469 1181.4226 1198.7045 1205.4985 1206.9133 1216.7443 1259.2320 1276.0256 1307.6492 1351.2565 1356.9561 1377.4457 1383.6288 1402.2861 1404.3650 1431.9521 1468.6785 1470.8534 1566.2643 1570.4986 1600.3282 1602.5208 3007.6857 3082.4465 3145.0534 3148.8962 3175.0545 3177.1316 3188.4317 3188.9498
redmass: 10.5983 10.8535 13.8662 12.7689 13.5598 6.7057 6.9296 7.6372 10.4331 6.5352 15.1075 12.0606 6.8977 7.2245 4.9289 8.7391 4.2357 9.2102 6.9698 7.5139 4.3296 3.4702 5.1153 4.3926 4.7288 4.9593 5.2815 6.1501 6.7308 4.8740 6.4795 8.3476 8.6616 5.6990 6.9003 3.8824 6.5151 1.3413 3.1041 2.3534 4.9297 1.4492 1.6760 1.5702 1.3667 1.3898 3.3320 3.0750 2.6700 2.9392 1.5641 1.6676 2.5016 6.0431 1.3125 3.9026 3.7319 1.4402 1.2928 1.6713 4.3356 4.5225 6.3211 5.1897 3.9958 4.5401 1.2430 2.7575 2.4847 8.2162 8.1337 7.1580 7.2001 1.0669 1.0918 1.0901 1.0889 1.0963 1.0962 1.0929 1.0925
irintensity: 0.1922 1.1850 0.3174 0.6416 0.6521 0.3696 0.2902 1.1497 1.4262 0.9142 3.7449 0.1887 0.7950 0.1696 1.3096 2.7654 0.6665 3.0509 3.5372 4.9682 2.0520 1.6007 5.5573 7.7473 20.7184 8.5639 12.1641 5.1800 5.1699 1.1629 10.3512 5.4398 33.5806 9.0678 24.8915 13.2694 4.6310 32.9858 29.9606 9.0166 45.4180 24.2305 7.8535 9.6362 0.0720 1.9066 10.1527 32.6181 47.6831 18.0500 18.1658 15.2290 25.8870 164.7876 28.3811 155.9978 76.3223 1.5462 1.9833 7.8268 63.6124 38.4941 68.2905 61.7310 34.0202 32.2437 36.6508 187.1640 40.7086 4.8660 2.7385 9.1700 6.2753 6.1489 5.9022 5.2029 3.6730 1.0536 0.9339 8.5838 10.3939
temp: 298.150 k
press: 1.00000 atm
elementType: 17 17 8 8 8 8 7 7 6 6 6 6 6 6 6 6 6 6 6 6 6 1 1 1 1 1 1 1 1
symmnumber: 1
zpe: 495901.8 jmol-1
zpe.correction: 0.188879 hartree
zpe.thermalcorrener: 0.207280 hartree
zpe.thermalcorrenthalpy: 0.208224 hartree
zpe.thermalcorrgfe: 0.138460 hartree
zpe.sumelectzpe: -1829.050367 hartree
zpe.sumelectthermal: -1829.031965 hartree
zpe.sumelectthermalent: -1829.031021 hartree
zpe.sumelectthermalfe: -1829.100785 hartree
dipole: 3.4826 -2.6130 -4.8531
dipole: 6.5199
quadrupole: -141.6339 -143.6265 -136.8473
quadrupole: 9.9275 -3.5942 -0.8368
quadrupole: -0.9313 -2.9239 3.8553 9.9275 -3.5942 -0.8368
hfenergy: -1829.2392457 hartree
pointgroup: C01 [X(C13H8Cl2N2O4)]
dipole: 1.2842938 1.6120254 1.5270303 debye
polarizability: 271.7327969|21.3584902|162.1873963|27.7523334|-14.5985813|158.4742348 unknown
InChI: InChI=1S/C13H8Cl2N2O4/c14-10-3-1-8(12(6-10)16(18)19)5-9-2-4-11(15)7-13(9)17(20)21/h1-4,6-7H,5H2
charge 0 multiplicity 1
29 atoms
Cl -4.358887 2.828532 -1.456225
Cl 5.804945 1.070202 0.209955
O  -3.896542 -2.245198 -0.059047
O  1.897013 -0.662024 -2.815096
O  -2.255102 -2.379271 1.512528
O  0.20743 -1.485931 -1.537595
N  -2.885991 -1.75408 0.571949
N  1.329931 -0.865062 -1.674132
C  -0.03089 -0.782963 1.127487
C  -1.126327 0.082342 0.500501
C  1.390948 -0.329931 0.826272
C  -2.444898 -0.377565 0.223042
C  2.024254 -0.359965 -0.451919
C  -0.857446 1.434254 0.162345
C  2.184451 0.154118 1.899748
C  -3.430763 0.434468 -0.383343
C  3.358685 0.064478 -0.652646
C  -1.824212 2.279087 -0.419948
C  3.519394 0.578336 1.735689
C  -3.105309 1.760638 -0.694094
C  4.090563 0.528477 0.448417
H  -0.175475 -0.785583 2.224254
H  -0.168038 -1.827894 0.810287
H  0.139925 1.840425 0.357379
H  1.737325 0.195921 2.898726
H  -4.416034 0.012719 -0.59506
H  3.786478 0.019833 -1.656888
H  -1.583485 3.318527 -0.660499
H  4.100153 0.939911 2.588809
