program: Gaussian 09
title: 000253993
version: EM64L-G09RevD.01
frameworkgroup: C1[X(C10H13N7O2S)]
method: RPBEPBE
basis: SDD
operation: Freq
keyword: #p
keyword: freq=noraman
keyword: PBEPBE/SDD
title: #p freq=noraman PBEPBE/SDD
converged: YES YES NO NO
title: Mulliken charges:
elementType: S O O N N N N N N N C C C C C C C C C C H H H H H H H H H H H H H
charge: 0.288941 -0.295156 -0.254399 -0.169765 -0.411827 -0.046439 -0.135469 0.008963 -0.152790 0.050899 -0.339840 -0.370887 0.211133 0.110301 -0.219719 -0.364953 0.326214 -0.356069 -0.626031 -0.820935 0.214027 0.253083 0.265253 0.232604 0.274259 0.460792 0.271144 0.254436 0.275340 0.253087 0.284117 0.284787 0.244900
chargesum: 0.00000
title: Mulliken charges with hydrogens summed into heavy atoms:
elementType: S O O N N N N N N N C C C C C C C C C C
charge: 0.288941 -0.295156 -0.254399 -0.169765 0.048965 -0.046439 -0.135469 0.008963 -0.152790 0.050899 0.127270 0.126970 0.211133 0.110301 0.054540 -0.364953 0.326214 -0.084924 0.156832 -0.007131
polarizability: 2.61507662e+02 2.30144416e+01 2.21469786e+02 -5.32451196e+00 4.39293643e-01 8.99204217e+01
1716.lowfreq: -4.4012 -0.8527 0.0008 0.0015 0.0018 2.9092 20.5342 32.4108 44.0917
frequency: 20.5261 32.3876 44.0828 58.0821 81.3366 97.4839 102.5751 110.3534 132.1748 142.8834 147.3816 170.8606 202.6926 219.9941 229.1225 255.1905 265.7073 287.6073 320.7767 346.8215 390.4208 409.9554 436.1429 458.6832 496.0095 506.2652 537.9016 563.8530 626.2081 637.4611 652.5599 663.0833 688.0718 707.2988 750.4962 788.9631 814.2178 833.1288 836.6973 876.0415 902.0708 921.3246 931.8174 975.9337 979.3981 993.4311 1006.0307 1047.7973 1077.7492 1105.5219 1117.1128 1128.8827 1154.5956 1178.1310 1195.3272 1221.6863 1237.2472 1266.1900 1287.1782 1294.8516 1300.4348 1328.2883 1346.1871 1350.0128 1353.3566 1360.5691 1376.3553 1391.3107 1411.9588 1432.2955 1434.2447 1448.0293 1463.6776 1465.8299 1471.9381 1473.2851 1515.2202 1537.5580 1545.7151 1648.7448 2985.7451 3004.6712 3011.1119 3028.1906 3062.1466 3076.0675 3079.7815 3088.7468 3147.9603 3153.8843 3160.8485 3181.1911 3227.2943
redmass: 6.0278 7.0961 7.5875 4.2724 3.7150 3.0084 4.4956 1.3615 4.5178 1.9893 1.9063 4.5867 5.8237 4.1353 5.2451 4.9210 5.0732 5.0748 3.9254 3.1876 5.9551 10.6478 5.4130 4.1004 3.7504 5.9830 4.6096 6.8581 7.5948 4.9003 6.2056 6.7940 4.6890 11.4648 5.1156 5.6228 5.7608 1.8243 5.5000 2.5921 6.1977 2.7522 1.4160 2.0093 1.1876 1.3118 1.3351 2.4363 3.3904 5.6578 1.3279 4.1948 3.1816 2.6175 2.3005 2.9753 1.2929 1.8060 3.9902 6.9848 3.2846 1.6761 1.1455 6.0563 1.9723 1.3829 3.5490 1.7119 1.1866 2.2313 1.0522 1.0552 1.0442 1.1871 1.0705 1.3211 3.0415 2.5030 7.0348 9.5765 1.0662 1.0336 1.0603 1.0282 1.0953 1.1001 1.0942 1.1008 1.1009 1.1044 1.1056 1.0933 1.0985
irintensity: 0.2373 0.8209 0.8032 0.2736 6.5851 8.8099 0.6788 0.3157 0.4841 2.8946 4.9081 12.4618 1.3400 3.0769 3.1281 1.3849 6.2548 5.1666 8.3493 17.1818 1.2132 2.4759 0.8812 5.1602 2.2062 1.0384 1.1174 15.9544 0.8798 16.3718 2.5520 1.2771 10.5079 16.1537 14.5261 4.6267 26.3993 23.2989 59.2379 1.2632 99.7868 145.4173 18.1974 103.6872 8.8340 1.1023 79.7544 26.3327 46.6891 18.8264 0.5843 70.2152 103.2714 76.9055 28.7032 45.9795 16.7069 54.7618 71.3045 95.2996 94.5351 33.7553 4.6738 66.1856 62.7344 1.6207 7.0883 40.5154 33.8012 21.6972 14.9557 30.9615 20.4437 32.1558 34.0008 14.1171 760.6462 115.2593 54.4499 296.9648 34.7792 21.6103 22.1784 22.7278 584.0449 212.3828 322.6378 14.7367 0.2585 6.9397 8.6269 6.6081 0.0366
temp: 298.150 k
press: 1.00000 atm
elementType: 16 8 8 7 7 7 7 7 7 7 6 6 6 6 6 6 6 6 6 6 1 1 1 1 1 1 1 1 1 1 1 1 1
symmnumber: 1
zpe: 638963.9 jmol-1
zpe.correction: 0.243369 hartree
zpe.thermalcorrener: 0.262811 hartree
zpe.thermalcorrenthalpy: 0.263755 hartree
zpe.thermalcorrgfe: 0.193209 hartree
zpe.sumelectzpe: -1319.114209 hartree
zpe.sumelectthermal: -1319.094767 hartree
zpe.sumelectthermalent: -1319.093822 hartree
zpe.sumelectthermalfe: -1319.164369 hartree
dipole: -0.2754 2.1351 -0.2869
dipole: 2.1719
quadrupole: -132.9479 -118.3313 -122.9667
quadrupole: 9.3454 -2.7810 -3.4780
quadrupole: -8.1993 6.4174 1.7819 9.3454 -2.7810 -3.4780
hfenergy: -1319.3575778 hartree
pointgroup: C01 [X(C10H13N7O2S1)]
dipole: 0.0623988 0.8520442 0.0160951 debye
polarizability: 263.8240233|-21.3104029|217.2628645|-4.7020885|-14.9868545|91.8109814 unknown
InChI: InChI=1S/C10H13N7O2S/c1-16(15-19)10(18)11-3-4-17-6-14-7-8(17)12-5-13-9(7)20-2/h5-6,11H,3-4H2,1-2H3
charge 0 multiplicity 1
33 atoms
S  5.167873 -0.217939 0.030688
O  -4.369457 1.011786 -0.291832
O  -2.781747 -3.131258 0.898712
N  0.728513 2.194585 0.17087
N  -2.060424 0.603382 -0.168381
N  3.025187 2.352186 0.016923
N  0.52305 -0.27734 0.311803
N  2.68923 -1.400035 0.256734
N  -3.61115 -1.119957 0.356535
N  -2.496044 -1.935192 0.534384
C  -0.676271 2.644286 0.320856
C  -1.6803 1.944654 -0.625849
C  1.221068 0.888425 0.214609
C  2.643776 1.002713 0.119272
C  1.861293 3.022869 0.053177
C  3.368193 -0.22021 0.144726
C  -3.377709 0.257741 -0.064669
C  1.323029 -1.380994 0.332032
C  -4.980958 -1.620659 0.557606
C  5.50508 -2.068327 0.119127
H  -0.680149 3.728093 0.108895
H  -0.998699 2.495792 1.368018
H  -2.602277 2.550241 -0.673196
H  -1.251516 1.904526 -1.646966
H  1.770239 4.106448 -0.00056
H  -1.281488 -0.060534 0.062196
H  0.820044 -2.347679 0.415021
H  -5.165825 -2.484797 -0.103548
H  -5.667813 -0.7958 0.322936
H  -5.112315 -1.954725 1.601405
H  5.01794 -2.575143 -0.724808
H  5.120849 -2.470668 1.06615
H  6.600276 -2.16387 0.061733
