program: Gaussian 09
title: 000018013
version: EM64L-G09RevD.01
frameworkgroup: C1[X(C5H14OSi)]
method: RPBEPBE
basis: SDD
operation: Freq
keyword: #p
keyword: freq=noraman
keyword: PBEPBE/SDD
title: #p freq=noraman PBEPBE/SDD
converged: YES YES NO NO
title: Mulliken charges:
elementType: Si O C C C C C H H H H H H H H H H H H H H
charge: 1.262334 -0.443257 -0.772208 -1.022222 -1.020267 -1.012312 -0.297362 0.209801 0.242440 0.236359 0.234730 0.235759 0.236511 0.234248 0.232144 0.232981 0.235395 0.234323 0.222661 0.189877 0.328065
chargesum: 0.00000
title: Mulliken charges with hydrogens summed into heavy atoms:
elementType: Si O C C C C C
charge: 1.262334 -0.115192 -0.319967 -0.315373 -0.317363 -0.309613 0.115175
polarizability: 9.12217110e+01 2.49278452e-01 7.98223707e+01 3.95886440e-01 1.28413022e+00 7.81573496e+01
1716.lowfreq: -11.1088 -8.8640 -0.0016 0.0012 0.0018 7.9813 60.9643 88.7267 103.8946
frequency: 60.0071 88.6318 103.8722 113.9478 131.3904 138.7573 184.7651 189.4850 204.0286 233.7879 282.5422 313.4918 357.8298 583.6074 683.4851 691.3245 707.2849 712.1443 736.6065 805.8476 810.2933 892.4652 897.6046 920.9919 939.1626 965.5169 1036.4230 1120.7307 1191.8076 1277.3917 1291.8792 1294.5392 1306.6987 1318.7309 1380.5980 1437.8697 1443.0683 1445.8147 1447.8546 1455.8376 1457.9086 1462.2896 1479.4703 2948.9570 2964.5561 2978.3907 2978.9896 2980.1431 3029.9042 3071.4158 3080.0512 3080.9935 3081.9148 3083.0277 3083.5056 3084.5298 3557.4300
redmass: 2.1997 2.0455 2.0584 1.3303 1.0562 1.0331 2.3725 2.5522 2.4889 2.5232 2.6200 1.2840 4.3848 3.7769 2.8817 3.4394 2.2388 1.3130 1.1679 1.4556 1.2630 1.3760 1.5630 1.7279 3.0553 1.6470 3.8572 1.1356 1.3237 1.2099 1.2028 1.2062 1.1895 1.2167 1.1890 1.0827 1.0553 1.0540 1.0569 1.0497 1.0508 1.0471 1.0823 1.0694 1.0604 1.0344 1.0343 1.0343 1.0953 1.0966 1.0982 1.0983 1.0986 1.0977 1.0978 1.0978 1.0661
irintensity: 2.7205 3.4363 0.8061 0.6197 0.3158 0.0432 0.8085 0.8587 3.0093 1.5721 18.3843 109.4426 39.1929 3.3625 5.2875 8.9877 7.0324 6.8567 0.0106 16.3063 23.6996 49.2613 81.5995 242.9839 30.0219 44.7564 52.4471 57.3262 36.9219 5.4040 44.7276 47.0180 11.0878 5.3201 30.7489 2.2663 0.2710 0.3118 0.5618 9.1996 16.2844 18.1462 2.7600 58.5699 24.6216 20.1430 19.9357 6.8956 12.7940 32.6576 4.1751 3.2847 6.0436 33.0978 37.5861 38.3593 7.0338
temp: 298.150 k
press: 1.00000 atm
elementType: 14 8 6 6 6 6 6 1 1 1 1 1 1 1 1 1 1 1 1 1 1
symmnumber: 1
zpe: 470141.9 jmol-1
zpe.correction: 0.179068 hartree
zpe.thermalcorrener: 0.190978 hartree
zpe.thermalcorrenthalpy: 0.191922 hartree
zpe.thermalcorrgfe: 0.141717 hartree
zpe.sumelectzpe: -562.948264 hartree
zpe.sumelectthermal: -562.936354 hartree
zpe.sumelectthermalent: -562.935410 hartree
zpe.sumelectthermalfe: -562.985615 hartree
dipole: -1.8640 0.7107 1.1684
dipole: 2.3118
quadrupole: -62.1662 -51.9530 -52.9926
quadrupole: 3.3483 4.6806 1.3041
quadrupole: -6.4622 3.7509 2.7113 3.3483 4.6806 1.3041
hfenergy: -563.1273318 hartree
pointgroup: C01 [X(C5H14O1Si1)]
dipole: -0.7376725 -0.1868777 -0.4981747 debye
dipolederiv: 1.3738247 0.0188487 -0.0067581 -0.0559785 1.2107605 -0.0017947 -0.0045172 -0.0058589 1.2247785 -1.0871204 0.0378306 0.0813659 0.0540749 -0.4615621 0.1901568 0.1035941 0.1860382 -0.2410667 -0.6158279 -0.0210767 0.0183195 -0.1548362 -0.31378 0.0250275 -0.0099249 0.0256973 -0.1663314 -0.3242161 0.0131126 0.0219573 0.0277014 -0.3477634 -0.0907233 0.0218585 -0.0833053 -0.4179613 -0.3306152 0.018277 -0.0282442 0.0390325 -0.3552593 0.0933755 -0.0280107 0.0894725 -0.4090914 -0.4095321 -0.1019368 0.0034963 -0.0808793 -0.39128 0.0019865 0.0017308 0.0022981 -0.280923 0.8332535 -0.1291325 -0.0205598 0.0962104 0.3974188 -0.071485 -0.031719 -0.0595918 0.2906687 0.0517156 0.0457457 0.0795729 -0.0165617 -0.0130801 -0.1098297 0.0566178 -0.1295847 -0.0862577 0.0678191 0.0411101 -0.061448 -0.0205172 -0.0319305 0.1028631 -0.0320218 0.1094022 -0.0283103 0.0992126 0.0190726 -0.0457425 0.0148655 0.0571566 0.088895 -0.048835 0.1036775 -0.101543 0.0309253 -0.1226844 -0.0187271 -0.1303552 -0.0730095 -0.012195 -0.0306181 -0.0296472 0.0986748 -0.1176133 0.0887618 0.0477306 0.102412 0.0697651 -0.0173972 0.063965 -0.0217438 0.0952042 -0.1235449 0.0965371 -0.0270996 0.1071923 0.0656643 0.0079461 -0.0436629 0.0146079 0.1032045 0.0319097 -0.1235033 0.0233145 -0.1345031 -0.0701201 0.0193176 0.0352232 0.0329471 0.0971132 0.1037806 0.0102819 0.0280783 0.0055023 0.0599424 -0.0894204 0.0292164 -0.1014293 -0.1194461 0.108946 -0.0007989 -0.0020962 0.0059792 -0.0061444 -0.134204 0.0027973 -0.1271886 -0.0530538 0.1084985 0.0070477 -0.0068486 0.0142881 -0.0133194 0.1342527 -0.0115196 0.1265921 -0.0416292 -0.1706756 0.0490488 0.0089238 0.0284394 0.0928022 -0.0011051 0.0089445 -0.0018953 0.1049731 0.0404415 0.0231449 0.0088064 0.0208747 -0.0074478 -0.0835978 0.0100824 -0.1144823 -0.0663895 -0.0289286 0.0474181 -0.0259235 0.0328701 -0.0842844 0.1182636 -0.0339357 0.1644894 -0.0985779 0.3577471 -0.0171049 -0.0781178 0.0441883 0.2154712 -0.1703324 -0.0592651 -0.180495 0.0959643 unknown
polarizability: 91.2129944|-0.1314716|79.2726739|-0.5563434|1.5043781|78.715763 unknown
InChI: InChI=1S/C5H14OSi/c1-7(2,3)5-4-6/h6H,4-5H2,1-3H3
charge 0 multiplicity 1
21 atoms
Si -1.019126 -0.017487 -0.00358
O  3.24788 -0.205203 0.028799
C  0.784664 -0.711298 -0.071078
C  -1.241168 1.027559 1.587204
C  -1.350464 1.078791 -1.541545
C  -2.236417 -1.495637 0.009709
C  1.884219 0.362178 -0.023684
H  0.884902 -1.313673 -0.99967
H  0.926108 -1.410008 0.777835
H  -1.001552 0.436302 2.490377
H  -0.584429 1.917025 1.580113
H  -2.284349 1.382131 1.682203
H  -2.390226 1.455603 -1.53746
H  -0.67642 1.955003 -1.565937
H  -1.20241 0.50978 -2.478296
H  -2.119947 -2.116018 -0.898258
H  -2.065301 -2.144816 0.888288
H  -3.284295 -1.144488 0.047079
H  1.815894 0.958668 0.902017
H  1.7921 1.053475 -0.889922
H  3.356935 -0.826388 -0.735592
