program: Gaussian 09
title: 000254104
version: EM64L-G09RevD.01
frameworkgroup: C1[X(C22H20O7)]
method: RPBEPBE
basis: SDD
operation: Freq
keyword: #pfreq=noraman
keyword: PBEPBE/SDD
title: #p freq=noraman PBEPBE/SDD
converged: YES YES NO NO
title: Mulliken charges:
elementType: O O O O O O O C C C C C C C C C C C C C C C C C C C C C C H H H H H H H H H H H H H H H H H H H H
charge: -0.217572 -0.258856 -0.263512 -0.202137 -0.303893 -0.281252 -0.312173 -0.233071 -0.662588 -0.027247 0.420421 0.202547 -0.347136 0.168114 0.114780 -0.589852 0.388031 -0.485420 0.178701 0.162661 -0.549951 -0.570607 -0.203962 0.276880 0.254004 0.008259 -0.528503 -0.526467 -0.524498 0.275292 0.239094 0.231902 0.228538 0.221010 0.265261 0.288922 0.277749 0.279278 0.237690 0.243619 0.219679 0.229316 0.254118 0.231095 0.211523 0.261164 0.225209 0.252886 0.240954
chargesum: 0.00000
title: Mulliken charges with hydrogens summed into heavy atoms:
elementType: O O O O O O O C C C C C C C C C C C C C C C C C C C C C C
charge: -0.217572 -0.258856 -0.263512 -0.202137 -0.303893 -0.281252 -0.312173 0.042222 -0.191592 -0.027247 0.420421 0.202547 0.102412 0.168114 0.114780 -0.324591 0.388031 -0.196497 0.178701 0.162661 -0.272202 -0.291329 0.277346 0.276880 0.254004 0.008259 0.174610 0.177315 0.194550
polarizability: 3.55382314e+02 -1.01456364e+01 3.26657780e+02 -1.17125436e+01 4.42325658e-01 1.79574308e+02
1716.lowfreq: -7.0942 -5.2465 0.0004 0.0008 0.0008 2.4020 20.2313 32.0103 34.6001
frequency: 20.2298 31.9848 34.5895 49.1626 60.4696 64.1157 72.1036 77.2220 82.9927 92.8754 126.3082 132.8242 146.1102 157.9691 161.5279 171.1806 178.5479 189.1102 208.1592 219.0236 231.4088 246.3704 255.3393 273.5534 283.0586 294.0583 317.6916 325.3439 355.8283 369.2181 418.0810 423.9298 443.4554 453.0832 489.0027 514.1690 524.3986 539.5101 567.4358 591.3174 605.3663 631.6102 643.1845 659.0802 667.8067 677.6733 680.5975 687.9663 725.9165 743.8068 755.8439 764.1535 776.0058 778.4007 836.9541 841.2172 867.2331 870.1802 884.5984 886.8968 902.0762 909.6172 919.8318 938.3768 949.6820 956.7071 975.3552 983.0185 1028.4551 1033.4654 1042.2289 1066.9053 1069.5040 1086.0272 1112.4268 1112.7479 1114.5174 1117.8884 1123.2114 1150.7386 1153.8071 1158.5666 1160.4958 1165.9549 1175.7793 1186.9319 1189.8451 1214.9681 1235.0531 1236.4395 1266.5390 1279.7648 1302.0689 1322.7211 1336.6676 1347.4579 1356.4708 1359.7555 1389.3291 1390.7938 1418.1388 1424.3273 1433.9255 1436.1675 1453.1130 1454.8900 1457.6613 1460.7801 1464.3942 1475.7640 1476.5602 1480.2981 1484.1506 1486.5965 1489.4606 1557.1649 1589.7446 1603.1053 1611.3178 1628.7195 1669.0347 2943.6671 2959.1754 2971.4416 2972.8678 2979.7498 2998.4724 3009.6993 3041.1147 3070.4145 3080.2277 3081.4137 3096.1543 3104.3635 3120.9054 3122.3396 3126.7262 3160.9541 3165.9292 3179.7039 3185.3924
redmass: 4.8640 5.1769 5.1990 3.0826 3.7667 3.8745 4.5546 3.7027 2.8371 3.0035 6.0247 3.6887 1.2738 3.2874 1.6448 2.2275 1.2017 3.8829 4.1675 3.2675 5.1899 6.7199 5.5646 5.1534 5.2122 5.5485 5.5985 4.5970 6.8071 5.4535 4.5383 4.3751 4.9587 4.1749 4.2894 5.8270 6.0952 6.1358 7.0164 5.2455 5.9197 4.6239 7.6501 5.1070 6.1684 5.6898 9.0886 7.0061 5.4750 5.6771 4.2059 4.8768 6.4029 6.5104 10.0157 4.2044 4.6474 1.4147 1.7436 1.5946 1.5112 4.6020 1.5937 9.2596 9.5606 4.4648 5.4041 4.3927 4.1895 3.5331 4.9140 1.4801 2.8985 2.2520 1.2380 1.2443 1.3213 2.4265 1.1254 1.3838 1.4603 1.5334 1.9731 1.3833 1.8089 1.3669 2.7486 1.4596 1.8025 1.7772 1.4561 3.6436 1.4949 5.4395 1.8179 1.6992 4.8828 1.3741 3.1766 4.1595 1.3984 3.8106 1.3709 1.3181 1.1490 1.3592 1.0589 1.0619 1.6430 1.6277 1.0633 1.0873 1.0545 1.0563 1.7786 7.3936 10.1884 7.0114 8.1933 10.0120 12.8111 1.0710 1.0778 1.0319 1.0340 1.0292 1.0644 1.0577 1.0945 1.1027 1.0990 1.1049 1.1022 1.1142 1.1029 1.1035 1.1043 1.0918 1.0929 1.0926 1.0925
irintensity: 0.2566 1.1385 2.4142 7.3944 4.5242 7.1784 4.3656 0.7754 4.4716 8.6755 1.0123 1.0269 0.3727 2.9305 0.4644 2.2513 0.4606 1.4278 1.2316 3.7345 14.6748 4.0838 1.7764 6.2351 7.5472 3.5820 4.8429 2.2377 1.4186 5.2845 6.4357 2.8743 9.0908 0.6110 2.4058 1.7719 0.8726 2.7724 5.5444 3.3923 3.1655 9.5481 3.1509 11.3983 11.2452 9.7937 0.5787 1.2222 6.7383 11.9523 13.5683 5.8140 20.4795 12.7787 18.9095 37.7224 7.3117 8.4043 22.4384 31.6132 9.2216 44.7795 28.4879 67.5586 86.0480 66.3876 204.9430 68.1699 127.2586 92.8055 107.5959 6.5454 7.2204 34.2620 10.7520 8.7980 11.9866 33.9165 6.1025 4.8788 14.5740 10.8494 9.2566 28.2022 39.4425 14.2009 168.1951 21.0215 45.6433 30.4904 67.1850 138.9248 16.3505 254.0265 22.8114 8.0736 80.8213 4.1257 77.0926 10.8683 10.2898 1.9551 14.4676 32.4200 26.3816 36.5756 12.3511 4.9172 28.5337 96.4764 5.5097 9.9988 18.8748 31.2085 84.5269 94.1012 137.7517 19.4822 48.0385 39.0240 328.5147 15.0369 21.5256 53.4716 113.2234 59.7230 68.6559 141.5846 30.8012 26.7614 26.2622 24.7751 33.0954 27.9706 22.6727 28.0122 15.6217 1.3731 4.5710 0.1959 2.1828
temp: 298.150 k
press: 1.00000 atm
elementType: 8 8 8 8 8 8 8 6 6 6 6 6 6 6 6 6 6 6 6 6 6 6 6 6 6 6 6 6 6 1 1 1 1 1 1 1 1 1 1 1 1 1 1 1 1 1 1 1 1
symmnumber: 1
zpe: 980492.0 jmol-1
zpe.correction: 0.373450 hartree
zpe.thermalcorrener: 0.400224 hartree
zpe.thermalcorrenthalpy: 0.401168 hartree
zpe.thermalcorrgfe: 0.314960 hartree
zpe.sumelectzpe: -1374.737233 hartree
zpe.sumelectthermal: -1374.710459 hartree
zpe.sumelectthermalent: -1374.709515 hartree
zpe.sumelectthermalfe: -1374.795723 hartree
dipole: 3.7921 -5.2648 0.4262
dipole: 6.5023
quadrupole: -138.8096 -169.7902 -163.3356
quadrupole: 18.0111 1.5511 -3.0008
quadrupole: 18.5022 -12.4784 -6.0238 18.0111 1.5511 -3.0008
hfenergy: -1375.1106828 hartree
pointgroup: C01 [X(C22H20O7)]
dipole: 1.6107292 -1.9722398 -0.2452275 debye
polarizability: 354.3283588|-4.8587732|321.9327974|-23.4448938|22.7790916|185.3532459 unknown
InChI: InChI=1S/C22H20O7/c1-24-17-6-12(7-18(25-2)21(17)26-3)19-14-8-16-15(28-10-29-16)5-11(14)4-13-9-27-22(23)20(13)19/h5-8,13H,4,9-10H2,1-3H3
charge 0 multiplicity 1
49 atoms
O  0.401599 4.775372 0.35549
O  5.09815 -2.274255 -0.566166
O  3.029803 -3.316302 0.071855
O  -1.529162 3.48694 0.502803
O  -2.761337 -1.698056 -2.266164
O  -3.84051 0.209234 2.181449
O  -4.66558 -1.345909 -0.122669
C  2.119762 3.06235 0.333191
C  3.051013 2.361282 -0.667982
C  0.730777 2.440637 0.293613
C  3.011642 0.855482 -0.439048
C  0.55044 1.084205 0.113281
C  1.836993 4.554079 0.03173
C  1.766757 0.243186 -0.068504
C  -0.289472 3.515497 0.393087
C  4.179414 0.07354 -0.628392
C  -0.793502 0.428372 0.077696
C  1.698559 -1.173472 0.129782
C  4.079563 -1.305967 -0.428054
C  2.862813 -1.911887 -0.052587
C  -1.705418 0.56905 1.149202
C  -1.152422 -0.37815 -1.034828
C  4.482988 -3.557535 -0.117054
C  -2.421694 -0.983715 -1.093568
C  -2.97434 -0.050479 1.106905
C  -3.361014 -0.802017 -0.038872
C  -3.096354 -3.126142 -2.06105
C  -4.499723 -0.952074 2.817619
C  -5.526721 -0.645056 -1.110885
H  2.537356 2.957354 1.356919
H  4.085886 2.739497 -0.581912
H  2.705069 2.588895 -1.699918
H  2.417396 5.256963 0.648919
H  1.98353 4.787151 -1.040359
H  5.12734 0.535114 -0.918044
H  0.762963 -1.652802 0.424311
H  -1.463948 1.177896 2.023587
H  -0.46768 -0.527133 -1.874983
H  4.933399 -3.847716 0.849697
H  4.624478 -4.314321 -0.904612
H  -2.21524 -3.670306 -1.670168
H  -3.359016 -3.508691 -3.059146
H  -3.947501 -3.23673 -1.366117
H  -5.14643 -0.519037 3.595829
H  -3.740846 -1.609695 3.284726
H  -5.096095 -1.519839 2.084821
H  -6.495488 -1.166789 -1.0793
H  -5.083197 -0.711726 -2.120515
H  -5.652097 0.412801 -0.817212
