program: Gaussian 09
title: 000250113
version: EM64L-G09RevD.01
frameworkgroup: C1[X(C13H14O2)]
method: RPBEPBE
basis: SDD
operation: Freq
keyword: #pfreq=noraman
keyword: PBEPBE/SDD
title: #p freq=noraman PBEPBE/SDD
converged: YES YES NO NO
title: Mulliken charges:
elementType: O O C C C C C C C C C C C C C H H H H H H H H H H H H H H
charge: -0.277948 -0.266409 0.427120 0.188824 -0.344357 -0.384065 -0.358519 -0.813139 0.170597 -0.239531 -0.244433 -0.234018 -0.366038 -0.032669 -0.552676 0.256882 0.237363 0.253498 0.235558 0.230076 0.270084 0.230547 0.228397 0.232204 0.239538 0.219221 0.255119 0.221605 0.217170
chargesum: 0.00000
title: Mulliken charges with hydrogens summed into heavy atoms:
elementType: O O C C C C C C C C C C C C C
charge: -0.277948 -0.266409 0.427120 0.188824 -0.087475 -0.146702 -0.105022 -0.077421 0.170597 -0.008984 -0.016036 -0.001814 0.092721 0.222450 -0.113901
polarizability: 2.80860494e+02 1.41559491e+01 1.35107348e+02 -1.76859662e+00 -3.47549292e+00 8.12562689e+01
1716.lowfreq: 0.0005 0.0009 0.0009 3.2665 7.0492 13.5633 28.6732 31.0846 41.7999
frequency: 28.3959 30.9668 41.7579 68.7988 93.6662 106.2789 121.6662 186.8022 213.9489 256.3017 275.6581 294.5304 321.7925 355.4250 408.6253 435.9454 445.9632 506.5475 526.6718 561.8226 615.0376 653.4397 693.5655 700.4496 704.0850 765.7696 780.5220 813.5218 849.8415 897.2694 918.7531 933.6012 959.8269 961.2287 968.2870 979.9351 987.2089 998.0684 1003.8686 1019.6429 1030.4443 1042.2865 1071.2177 1088.8775 1157.6895 1173.8601 1194.2940 1198.4240 1252.1658 1252.7377 1279.7971 1324.9902 1345.7266 1368.5083 1393.8135 1404.4300 1427.7396 1437.9120 1447.7739 1473.7394 1479.8924 1484.3963 1578.2791 1582.5973 1609.7271 1638.4845 1660.2817 2977.6871 3018.7058 3062.8173 3090.5552 3095.4673 3105.9363 3116.6588 3122.6931 3129.6808 3131.1717 3145.2501 3162.7046 3184.6165 3200.3510
redmass: 3.9871 3.4606 4.4077 3.8240 5.0746 2.7108 3.1429 1.8285 2.3093 5.0655 3.2721 4.7551 2.8292 2.4849 2.7771 3.5196 2.3132 4.7424 2.5755 4.1025 6.3767 2.2384 3.4891 1.7800 4.5788 2.3548 3.2189 4.5585 1.2494 3.0672 1.3707 1.7763 1.4206 1.4897 2.0683 1.4357 4.9503 1.3614 2.0873 1.2135 1.9644 1.4843 2.9283 1.6914 2.0646 1.0715 1.2494 1.8217 3.4878 1.1477 1.2469 1.4612 1.2373 2.6212 1.8723 1.4753 1.1558 2.1900 1.1480 1.0744 1.1805 1.8670 5.6778 8.6122 6.0338 7.3542 4.6009 1.0429 1.0601 1.0924 1.0609 1.0878 1.1026 1.0973 1.0865 1.0966 1.0879 1.0937 1.0992 1.0948 1.1143
irintensity: 0.5304 0.0980 1.6390 0.1188 0.3509 0.5163 0.9370 0.7550 0.1665 2.1763 1.0020 16.2361 0.0228 3.9271 0.3966 5.0755 11.3918 5.8839 20.0577 11.6175 0.2373 6.0219 16.9692 47.8135 10.4866 44.1291 11.7589 5.4211 0.4079 52.9989 2.3133 69.3634 37.9922 44.4586 21.8581 2.7826 2.9469 0.4013 0.8448 45.0938 0.2806 4.9376 445.7743 53.2834 31.4152 6.5274 80.5712 212.3353 92.6437 3.9663 9.9750 15.1704 7.2776 10.4478 3.7360 26.3769 11.2175 13.7104 40.1588 20.7881 7.3140 29.4853 12.0764 211.4448 1.4813 39.7897 4.0441 16.3835 36.1272 17.2781 9.5198 0.6382 9.2663 7.9034 4.5683 5.7889 0.4102 26.3467 38.2391 9.3457 22.6513
temp: 298.150 k
press: 1.00000 atm
elementType: 8 8 6 6 6 6 6 6 6 6 6 6 6 6 6 1 1 1 1 1 1 1 1 1 1 1 1 1 1
symmnumber: 1
zpe: 612666.7 jmol-1
zpe.correction: 0.233352 hartree
zpe.thermalcorrener: 0.248155 hartree
zpe.thermalcorrenthalpy: 0.249100 hartree
zpe.thermalcorrgfe: 0.189344 hartree
zpe.sumelectzpe: -653.107002 hartree
zpe.sumelectthermal: -653.092199 hartree
zpe.sumelectthermalent: -653.091254 hartree
zpe.sumelectthermalfe: -653.151010 hartree
dipole: -0.8775 1.6231 0.5246
dipole: 1.9182
quadrupole: -69.1686 -85.5529 -91.6541
quadrupole: 3.5393 -0.3145 -4.0026
quadrupole: 12.9566 -3.4277 -9.5289 3.5393 -0.3145 -4.0026
hfenergy: -653.340354 hartree
pointgroup: C01 [X(C13H14O2)]
dipole: 0.3498137 -0.5983186 -0.2986739 debye
polarizability: 280.1439703|6.5646001|104.279795|16.5328008|27.0064517|112.8003455 unknown
InChI: InChI=1S/C13H14O2/c1-3-9-15-13(14)11(2)10-12-7-5-4-6-8-12/h3-8,10H,1,9H2,2H3
charge 0 multiplicity 1
29 atoms
O  -2.755738 -0.236782 -0.755568
O  -1.936854 1.514716 0.546935
C  2.103922 0.124774 0.275465
C  -0.393262 -0.199713 -0.316249
C  0.669792 0.445536 0.276956
C  2.910911 0.725294 1.290128
C  2.754368 -0.70872 -0.684485
C  -0.336363 -1.491764 -1.106984
C  -1.72154 0.459317 -0.107893
C  4.295037 0.477077 1.369865
C  4.14236 -0.947127 -0.610846
C  4.91853 -0.365803 0.419172
C  -4.127271 0.357706 -0.615255
C  -4.781839 -0.082122 0.669409
C  -5.907226 -0.836791 0.719318
H  0.395547 1.334365 0.86501
H  2.433158 1.386174 2.023749
H  2.18511 -1.139381 -1.511099
H  0.437255 -2.169374 -0.706471
H  -0.106972 -1.305597 -2.174679
H  -1.30969 -2.003506 -1.074351
H  4.88866 0.943014 2.164002
H  4.622903 -1.582026 -1.363676
H  5.9960 -0.556819 0.473189
H  -4.022259 1.457833 -0.647528
H  -4.668052 -0.011056 -1.500838
H  -4.300784 0.266552 1.592554
H  -6.369733 -1.114277 1.672888
H  -6.403068 -1.194201 -0.192221
