program: Gaussian 09
title: 000253955
version: EM64L-G09RevD.01
frameworkgroup: C1[X(C15H12O4)]
method: RPBEPBE
basis: SDD
operation: Freq
keyword: #pfreq=noraman
keyword: PBEPBE/SDD
title: #p freq=noraman PBEPBE/SDD
converged: NO YES NO NO
title: Mulliken charges:
elementType: O O O O C C C C C C C C C C C C C C C H H H H H H H H H H H H
charge: -0.268972 -0.285834 -0.264973 -0.257441 0.211893 0.229158 0.181386 0.056657 0.173365 -0.510352 -0.517895 0.214430 0.240524 -0.358543 -0.352557 -0.252187 -0.211852 -0.534785 -0.492346 0.292782 0.287748 0.279240 0.262136 0.234549 0.234671 0.232959 0.232965 0.242283 0.228278 0.236400 0.236313
chargesum: 0.00000
title: Mulliken charges with hydrogens summed into heavy atoms:
elementType: O O O O C C C C C C C C C C C C C C C
charge: -0.268972 -0.285834 -0.264973 -0.257441 0.211893 0.229158 0.181386 0.056657 0.173365 -0.217570 -0.230147 0.214430 0.240524 -0.079303 -0.090421 -0.017637 0.022819 0.173422 0.208644
polarizability: 3.22053312e+02 -4.76207269e+00 1.87825006e+02 -2.84104299e-02 -5.53223013e-02 7.63776582e+01
1716.lowfreq: -38.5153 -5.6844 -0.0008 -0.0007 -0.0001 4.8873 7.4855 48.2766 67.1258
frequency: -38.5088 48.2692 67.1245 108.3130 133.9216 137.5369 171.1184 178.0734 199.1833 218.6583 254.3411 262.2687 291.3035 300.7906 309.7783 350.1036 391.9540 420.6366 444.2509 462.3815 488.6248 518.9515 526.9591 545.8353 607.3195 624.8338 663.0065 682.5099 697.3590 707.4962 719.4648 746.3930 767.9163 799.2886 843.8380 867.2216 881.8280 894.7475 900.2605 959.0458 972.2605 987.4085 999.2143 1025.1875 1085.7029 1107.5321 1113.8959 1118.3528 1142.6477 1156.2465 1158.8396 1163.7548 1180.9768 1206.6361 1226.9220 1240.3129 1284.1667 1306.4233 1393.6627 1397.7387 1417.9735 1436.8355 1447.5767 1453.7211 1456.5364 1460.4442 1463.2511 1465.8038 1474.2291 1493.8522 1549.9064 1557.1116 1594.4150 1612.9385 1636.0866 2967.3090 3005.6813 3058.2969 3117.2465 3128.3857 3129.2889 3137.8985 3150.6172 3162.4317 3164.1687 3175.1238 3184.4930
redmass: 2.9825 5.2063 5.0094 4.2431 5.2015 4.5647 2.7053 1.3050 3.7641 3.8367 4.6265 1.2996 5.8955 5.8376 6.8869 4.8085 5.9104 5.2403 4.3017 3.1124 8.2159 8.0071 3.7995 7.9312 7.1057 7.4441 5.2560 6.2784 5.0103 6.0412 3.2141 6.6204 1.5475 2.6518 6.3694 1.6131 1.4459 7.0209 1.4939 7.7216 1.3652 4.6184 1.3298 1.9842 3.5934 1.2410 1.2580 2.3452 1.4697 1.6211 1.4291 1.3125 4.1397 2.7631 2.0863 1.4325 2.9776 3.3079 5.9092 9.6814 2.3441 1.3436 2.3865 1.7060 1.0527 1.3760 1.8005 1.0489 1.1503 2.9141 10.2720 8.6045 8.8268 6.8954 7.7048 1.0323 1.0282 1.1043 1.1053 1.1005 1.1056 1.0859 1.0900 1.0902 1.0954 1.1000 1.0924
irintensity: 6.0263 6.5480 2.3548 0.8145 3.0098 4.7541 3.6228 0.0020 3.8422 0.8060 5.3140 0.4252 0.8878 0.0289 2.9433 10.4908 0.2675 0.8082 2.3958 0.1456 2.8412 1.3891 4.1988 7.8512 35.2493 5.4477 1.6933 4.1921 6.9733 5.7738 0.0229 28.8275 95.4405 4.6078 20.1790 27.3974 6.5980 0.9472 26.4213 6.4859 3.7139 86.3680 0.3154 16.3577 2.9600 0.0893 0.0461 125.6768 1.1535 106.0312 22.2996 43.6066 70.3917 97.6294 15.6827 2.0803 61.4997 419.7813 162.5330 22.0926 40.5919 42.4173 203.3390 36.5390 13.6274 19.9945 19.7228 12.7621 101.2538 143.0180 152.0850 50.6099 142.2659 163.3886 42.9499 50.0753 82.4133 37.0508 32.0730 24.9767 25.8993 3.8199 4.8635 8.8439 11.9557 21.6835 0.3050
temp: 298.150 k
press: 1.00000 atm
elementType: 8 8 8 8 6 6 6 6 6 6 6 6 6 6 6 6 6 6 6 1 1 1 1 1 1 1 1 1 1 1 1
symmnumber: 1
zpe: 612263.2 jmol-1
zpe.correction: 0.233199 hartree
zpe.thermalcorrener: 0.248546 hartree
zpe.thermalcorrenthalpy: 0.249490 hartree
zpe.thermalcorrgfe: 0.191036 hartree
zpe.sumelectzpe: -878.334134 hartree
zpe.sumelectthermal: -878.318787 hartree
zpe.sumelectthermalent: -878.317843 hartree
zpe.sumelectthermalfe: -878.376297 hartree
dipole: 2.4023 -0.7290 0.0093
dipole: 2.5105
quadrupole: -75.8990 -109.8335 -113.0296
quadrupole: 11.3811 0.0054 0.0221
quadrupole: 23.6884 -10.2462 -13.4422 11.3811 0.0054 0.0221
hfenergy: -878.5673331 hartree
pointgroup: C01 [X(C15H12O4)]
dipole: 0.9295485 -0.327396 0.0654759 debye
polarizability: 321.0588441|-10.4401846|187.3312655|8.3764543|-11.8801394|77.8658669 unknown
InChI: InChI=1S/C15H12O4/c1-17-13-7-10-12(8-14(13)18-2)19-11-6-4-3-5-9(11)15(10)16/h3-8H,1-2H3
charge 0 multiplicity 1
31 atoms
O  -1.225241 -1.6600 0.106926
O  3.899901 0.684215 0.018018
O  3.463466 -2.205188 0.302777
O  -0.982788 2.528378 -0.32364
C  0.1370 0.399966 -0.068523
C  0.020959 -1.00671 0.075606
C  -2.350723 0.532391 -0.155538
C  -1.055998 1.260586 -0.194263
C  -2.391208 -0.881721 -0.008575
C  1.440546 0.960766 -0.087525
C  1.155624 -1.825643 0.195175
C  2.590804 0.167887 0.030251
C  2.448579 -1.263691 0.175016
C  -3.583058 1.231554 -0.264503
C  -3.612752 -1.589158 0.029811
C  -4.806248 0.543147 -0.228232
C  -4.817776 -0.871887 -0.080423
C  4.040805 2.137678 -0.12463
C  4.899637 -1.862672 0.309603
H  1.495164 2.047823 -0.198528
H  1.051907 -2.907473 0.304882
H  -3.533494 2.319733 -0.376614
H  -3.594762 -2.676915 0.144033
H  -5.75043 1.090647 -0.313161
H  -5.770686 -1.411303 -0.051801
H  3.553544 2.669465 0.714811
H  3.613339 2.487772 -1.083523
H  5.124588 2.323879 -0.107587
H  5.398182 -2.837278 0.425922
H  5.145926 -1.197336 1.152322
H  5.198891 -1.38381 -0.63629
