program: Gaussian 09
title: 000253971
version: EM64L-G09RevD.01
frameworkgroup: C1[X(C12H5Cl5O3S)]
method: RPBEPBE
basis: SDD
operation: Freq
keyword: #p
keyword: freq=noraman
keyword: PBEPBE/SDD
title: #p freq=noraman PBEPBE/SDD
converged: YES YES NO NO
title: Mulliken charges:
elementType: Cl Cl Cl Cl Cl S O O O C C C C C C C C C C C C H H H H H
charge: 0.052603 0.090142 0.063075 0.059105 0.078407 0.956963 -0.321349 -0.471872 -0.489922 -0.053778 0.546401 -0.244019 -0.285644 -0.229420 -0.232333 -0.055342 -0.063736 -0.107569 -0.202988 -0.197624 -0.211003 0.289716 0.289420 0.248445 0.248572 0.243749
chargesum: 0.00000
title: Mulliken charges with hydrogens summed into heavy atoms:
elementType: Cl Cl Cl Cl Cl S O O O C C C C C C C C C C C C
charge: 0.052603 0.090142 0.063075 0.059105 0.078407 0.956963 -0.321349 -0.471872 -0.489922 -0.053778 0.546401 -0.244019 -0.285644 0.060296 0.057087 -0.055342 -0.063736 -0.107569 0.045457 0.050948 0.032746
polarizability: 4.16305584e+02 -4.70484564e+00 2.51152859e+02 -1.08634758e+01 7.82321400e+00 1.11710727e+02
1716.lowfreq: -4.9767 -1.5383 0.0027 0.0029 0.0033 4.4395 9.7004 22.3245 32.9610
frequency: 8.6409 22.2628 32.9508 51.5091 55.9147 67.8358 71.4568 89.9619 132.1528 149.3208 158.2113 167.6228 198.4893 203.5271 206.5973 215.7546 243.8091 265.1921 295.7653 316.0391 320.6415 325.6948 337.3155 351.0365 361.6135 404.5999 407.0759 414.9678 472.8548 492.2559 589.9972 599.3494 614.2806 646.9571 653.9879 665.2546 684.2858 718.8263 759.3998 801.0284 816.2457 819.5571 844.4194 933.7733 935.6573 948.2980 972.1605 984.7638 1005.2035 1006.6422 1043.1645 1081.0019 1084.7519 1175.5011 1181.9738 1224.3682 1291.1544 1308.1252 1314.5225 1347.2159 1384.1356 1438.0754 1450.7008 1479.1765 1520.4212 1571.0798 1600.5128 3143.1039 3154.0271 3162.9213 3171.7010 3179.8988
redmass: 9.1852 8.2096 16.1648 8.1157 5.9458 24.1201 24.7583 25.2055 9.8749 9.9816 13.7536 5.9866 30.1654 30.1334 25.0680 34.7337 9.0768 13.1991 23.1399 14.1376 25.8663 11.9898 9.5827 21.4719 13.3981 3.0014 8.8823 16.2158 11.0843 4.8591 12.0918 6.4914 13.3291 11.5398 7.3714 14.0534 2.4862 13.9810 1.3830 12.3056 15.9355 13.4264 1.2473 12.4928 1.3401 17.4846 6.5010 1.3907 4.6343 1.3472 2.0393 1.5614 12.1672 1.0546 1.1225 12.3421 12.0355 1.2891 12.2218 12.0174 8.4546 2.2646 1.9902 12.0011 12.0080 5.7655 6.8897 1.0862 1.0888 1.0929 1.0970 1.1016
irintensity: 1.4963 0.6541 0.2701 0.2919 0.2788 0.1258 0.2947 0.6165 4.1889 3.2678 0.9948 4.5348 0.3539 0.3534 0.1675 0.0037 19.6664 10.6133 0.0827 0.4366 3.6096 0.1937 0.5676 28.2910 17.8580 2.0701 33.3453 82.1182 6.3791 81.2792 0.0166 0.0220 13.3827 0.7303 1.1156 66.6964 27.3273 38.4120 65.6170 2.3459 58.4301 20.4291 0.6336 11.1488 1.5799 51.7550 10.8244 0.5160 0.2657 0.9715 27.0944 5.1390 5.5297 0.1332 21.8724 163.0598 56.4944 3.4904 55.3187 128.8708 7.5796 15.7293 17.1036 1.6502 73.0697 4.3265 0.6461 1.0066 9.8278 1.1432 0.6780 28.8429
temp: 298.150 k
press: 1.00000 atm
elementType: 17 17 17 17 17 16 8 8 8 6 6 6 6 6 6 6 6 6 6 6 6 1 1 1 1 1
symmnumber: 1
zpe: 365750.4 jmol-1
zpe.correction: 0.139307 hartree
zpe.thermalcorrener: 0.160614 hartree
zpe.thermalcorrenthalpy: 0.161558 hartree
zpe.thermalcorrgfe: 0.084550 hartree
zpe.sumelectzpe: -3382.612695 hartree
zpe.sumelectthermal: -3382.591388 hartree
zpe.sumelectthermalent: -3382.590443 hartree
zpe.sumelectthermalfe: -3382.667452 hartree
dipole: 4.4045 3.0926 -1.6062
dipole: 5.6164
quadrupole: -126.5905 -163.3921 -167.3087
quadrupole: 9.9441 -5.7170 4.9295
quadrupole: 25.8399 -10.9617 -14.8783 9.9441 -5.7170 4.9295
hfenergy: -3382.7520017 hartree
pointgroup: C01 [X(C12H5Cl5O3S1)]
dipole: -1.7530738 0.7904639 1.088317 debye
dipolederiv: -0.2303925 0.2827786 0.2690071 0.1623262 -0.2059425 -0.1854425 0.0856527 -0.1408767 -0.127656 0.0372073 -0.1264478 -0.0220668 0.1310266 -0.5383437 -0.1227698 0.0278423 -0.1822539 -0.0165906 -0.4651363 0.266188 0.1535 0.3485651 -0.1960978 -0.1210649 0.2384773 -0.1351064 -0.0599528 -0.0591239 -0.120554 -0.0482788 -0.2614362 -0.5497339 -0.2331429 -0.0772895 -0.2007798 -0.0668066 -0.8852091 -0.2476774 -0.0369842 -0.3407682 -0.0842853 -0.0228634 0.0465065 0.0056388 0.0265041 1.9156871 -0.0614641 0.0215672 -0.351751 0.8888569 -0.0138712 0.5475708 0.1386772 1.2980116 0.070687 0.006521 0.1651465 0.0277723 -0.3160717 0.0330889 0.2950454 0.0359897 -0.2969057 -0.9343731 -0.0742582 -0.0915608 -0.2935435 -0.5051751 -0.1650299 -0.3176337 -0.131941 -0.5417024 -0.5450045 0.0133437 0.0741988 0.4599115 -0.3898422 0.203958 -0.3232 -0.0045048 -0.5890482 0.0480555 -0.0120258 -0.0422459 -0.0423378 -0.0318592 -0.0031111 -0.3374322 -0.0485048 -0.1892322 -0.2330881 0.0833824 -0.0865982 -0.0207383 -0.0444247 -0.1178656 0.0474924 -0.0677181 0.0635099 0.5163973 -0.4070074 -0.3874013 0.0592683 0.1048224 0.2924323 -0.1608516 0.1274745 0.1581959 0.1224119 0.3764784 0.1703775 -0.1432645 0.7622004 0.1054155 -0.115061 0.2546959 -0.0384155 -0.3511268 0.1295074 -0.0089218 -0.221998 -0.0678508 0.0553566 0.0367096 -0.0337347 -0.0501324 -0.2005085 -0.1050423 -0.018037 0.3974491 -0.0441661 -0.0575722 0.011585 0.0700328 -0.0725165 0.4333065 -0.6491473 -0.32402 -0.9147902 -0.0002716 0.0455438 -0.4302128 0.1259611 0.0736206 -0.5827984 0.2697311 0.1254384 0.5425616 0.807077 0.3322571 0.3361612 0.2699361 0.0958716 1.1062833 0.3664454 0.0183393 0.4198396 0.0784288 -0.0131854 -0.0725368 -0.0336213 -0.0333766 -0.1096168 -0.0846571 -0.0039479 0.0136793 0.1345252 0.0197075 0.0456458 0.0628078 -0.1169296 0.0066012 0.1639766 -0.0614994 0.0695225 -0.0148098 -0.0266732 0.010622 -0.0702832 -0.0957568 0.0796423 -0.048924 -0.1203643 -0.0366431 0.0197577 0.027348 -0.110459 0.0335806 -0.0598392 0.1177959 -0.0641064 0.0388704 -0.0837173 0.1017431 -0.0011794 0.007394 0.0027642 0.1185685 0.181369 0.0451244 0.0283153 0.0264551 0.0533873 -0.0066077 -0.0569691 -0.0400715 0.1400335 0.0489871 0.0164122 0.0311659 0.0532395 -0.061958 -0.0201034 0.0781007 -0.0306359 0.137317 -0.0304147 -0.068571 0.0670979 -0.060909 0.0197213 0.0239983 0.1082256 0.0206414 0.129782 -0.057639 0.0499934 0.0889022 0.0602803 0.0803123 -0.0286236 0.0786144 -0.028168 0.1134466 unknown
polarizability: 415.8206902|13.074039|232.3075504|-8.5522044|48.6650809|131.0409289 unknown
InChI: InChI=1S/C6Cl5O.C6H5O2S/c7-1-2(8)4(10)6(12)5(11)3(1)9;7-9(8)6-4-2-1-3-5-6/h;1-5H
charge 0 multiplicity 1
26 atoms
Cl -0.000678 1.761079 1.480355
Cl 1.690365 -2.997893 -0.763652
Cl 4.721147 -1.869967 -0.92081
Cl 3.006026 2.931941 1.316204
Cl 5.352049 1.098855 0.120494
S  -1.477675 -0.847929 -1.165322
O  -0.22365 -1.08123 0.5269
O  -1.783166 -2.306592 -1.803499
O  -0.783592 0.340524 -2.032068
C  -3.038775 -0.223918 -0.323039
C  1.016477 -0.566584 0.368232
C  1.3290 0.764043 0.804422
C  2.085898 -1.354933 -0.177875
C  -3.191018 1.162402 -0.16095
C  -3.982847 -1.183502 0.078445
C  3.398991 -0.853415 -0.250098
C  2.640962 1.268717 0.737358
C  3.679729 0.459496 0.209448
C  -4.387339 1.612628 0.44237
C  -5.168093 -0.706984 0.684596
C  -5.36614 0.682281 0.866331
H  -2.41811 1.858543 -0.500329
H  -3.808104 -2.250605 -0.088987
H  -4.549767 2.686357 0.579468
H  -5.930673 -1.421207 1.010699
H  -6.287414 1.041492 1.336909
