program: Gaussian 09
title: 000253953
version: EM64L-G09RevD.01
frameworkgroup: C1[X(C14H12N2S2)]
method: RPBEPBE
basis: SDD
operation: Freq
keyword: #p
keyword: freq=noraman
keyword: PBEPBE/SDD
title: #p freq=noraman PBEPBE/SDD
converged: YES YES NO NO
title: Mulliken charges:
elementType: S S N N C C C C C C C C C C C C C C H H H H H H H H H H H H
charge: 0.182984 0.182984 -0.406272 -0.406273 -0.419800 -0.419800 0.604627 0.604628 -0.366343 -0.366343 -0.377799 -0.377800 -0.286721 -0.286721 -0.202749 -0.202748 -0.263550 -0.263550 0.293594 0.293594 0.317199 0.317199 0.233305 0.233306 0.239855 0.239855 0.224437 0.224437 0.227234 0.227234
chargesum: 0.00000
title: Mulliken charges with hydrogens summed into heavy atoms:
elementType: S S N N C C C C C C C C C C C C C C
charge: 0.182984 0.182984 -0.089074 -0.089074 -0.126207 -0.126207 0.604627 0.604628 -0.366343 -0.366343 -0.144494 -0.144494 -0.046866 -0.046866 0.021688 0.021688 -0.036316 -0.036316
polarizability: 2.14260183e+02 6.86947865e-06 2.23773716e+02 -4.18203648e+01 -2.23682624e-05 1.30012981e+02
1716.lowfreq: -14.2402 -10.3681 -2.5348 -0.0019 -0.0006 0.0017 23.3034 34.8285 49.6019
frequency: 23.0876 34.7077 49.3027 104.2750 127.6427 187.3491 197.8792 237.0587 245.6291 278.5840 327.1633 340.1081 349.1977 378.9235 420.4313 422.4592 440.4118 466.5884 473.5309 487.5556 537.4828 540.9876 569.5000 585.0410 649.4760 671.4778 674.6846 708.6103 715.6183 718.6327 742.3744 744.1154 793.7012 838.4702 840.5393 844.1765 848.6468 894.3939 915.7840 915.8721 961.9539 962.0971 1016.3602 1018.1511 1029.5308 1030.1045 1078.1472 1086.2136 1116.2049 1120.8176 1131.1859 1168.3622 1168.6150 1200.6681 1252.8568 1257.9475 1262.6417 1272.0899 1283.1953 1333.8995 1370.6552 1371.9656 1416.9887 1417.0391 1457.1184 1459.4267 1474.4654 1476.8355 1591.0089 1592.4221 1603.0293 1604.1662 3023.8063 3034.2650 3130.9921 3130.9946 3141.7729 3141.7880 3152.2667 3152.2978 3170.0739 3170.1718 3569.5220 3569.9978
redmass: 6.2723 5.6817 5.3861 4.9744 4.9202 6.6362 6.8725 8.0739 4.2744 1.9653 4.4665 4.5875 1.2905 2.0947 3.0994 3.1493 8.9269 11.1576 6.5132 6.5446 3.9414 3.9303 7.9152 6.5971 6.5355 6.7395 6.5960 4.7616 3.0624 3.2090 1.3849 1.3802 5.8795 1.5540 1.4012 3.4544 4.2156 3.9070 1.3837 1.3773 1.3052 1.3052 3.9062 3.6484 2.6406 2.6789 2.7347 2.2752 1.4860 1.5086 1.1841 1.0675 1.0583 1.7257 1.3223 1.4045 1.4102 1.9322 1.5597 1.4275 2.4797 2.8762 2.7333 2.7451 2.1601 2.1350 3.6597 3.9899 6.1844 6.0116 7.2975 7.4428 1.0866 1.0877 1.0853 1.0853 1.0893 1.0893 1.0950 1.0950 1.1004 1.1004 1.0775 1.0778
irintensity: 0.0360 0.3983 0.0228 7.5733 0.0768 3.1301 1.9977 0.1017 25.3470 3.4306 43.9473 0.3922 233.6208 41.8004 13.1440 0.1241 10.1789 0.0592 11.0560 0.0291 0.1803 1.0509 9.6638 1.8097 60.7445 10.1821 1.3489 1.8595 15.7764 1.5104 192.7362 16.0940 2.8340 12.6545 0.1320 17.7700 0.4243 9.2106 0.1034 7.1483 0.3843 0.0202 13.2101 40.3989 1.2014 5.3608 0.1495 0.9177 33.8585 5.5903 6.1612 0.2237 1.1336 20.3744 10.6561 5.8387 2.0774 26.4881 0.4057 94.1770 21.5870 61.9118 2.0400 1.2127 0.5580 26.4546 150.9898 135.9685 9.0683 16.4611 75.1670 16.4156 6.5657 46.1748 2.4939 2.8167 7.1822 3.0392 6.7956 35.2415 16.6891 25.6318 2.8331 65.4973
temp: 298.150 k
press: 1.00000 atm
elementType: 16 16 7 7 6 6 6 6 6 6 6 6 6 6 6 6 6 6 1 1 1 1 1 1 1 1 1 1 1 1
symmnumber: 1
zpe: 594039.1 jmol-1
zpe.correction: 0.226258 hartree
zpe.thermalcorrener: 0.241394 hartree
zpe.thermalcorrenthalpy: 0.242338 hartree
zpe.thermalcorrgfe: 0.182748 hartree
zpe.sumelectzpe: -1445.058678 hartree
zpe.sumelectthermal: -1445.043542 hartree
zpe.sumelectthermalent: -1445.042598 hartree
zpe.sumelectthermalfe: -1445.102188 hartree
dipole: 0.0000 0.7622 0.0000
dipole: 0.7622
quadrupole: -124.7112 -112.4771 -115.5941
quadrupole: 0.0000 -9.0996 0.0000
quadrupole: -7.1170 5.1170 2.0000 0.0000 -9.0996 0.0000
hfenergy: -1445.2849354 hartree
pointgroup: C01 [X(C14H12N2S2)]
dipole: -0.000004 0.2998643 -0.0000019 debye
polarizability: 205.5902792|-0.000177|223.7737164|-49.0325481|-0.0003423|138.6828845 unknown
InChI: InChI=1S/C14H12N2S2/c1-3-7-11-9(5-1)15-13(17-11)14-16-10-6-2-4-8-12(10)18-14/h1-8,13-16H
charge 0 multiplicity 1
30 atoms
S  2.168922 -2.232102 -0.773024
S  -2.168932 -2.232099 0.773021
N  0.854691 -0.996409 1.22319
N  -0.854702 -0.996417 -1.223201
C  0.656675 -2.200292 0.420452
C  -0.656686 -2.200295 -0.420456
C  1.701722 -0.012066 0.698394
C  -1.701735 -0.012071 -0.698412
C  2.505568 -0.461979 -0.386633
C  -2.505581 -0.461978 0.386617
C  1.838648 1.317545 1.159584
C  -1.838662 1.317536 -1.159611
C  3.442437 0.373696 -1.008883
C  -3.442451 0.3737 1.008861
C  2.785699 2.165393 0.535578
C  -2.785715 2.165387 -0.535611
C  3.584322 1.706962 -0.536758
C  -3.584338 1.706962 0.536727
H  0.698451 -3.12003 1.031911
H  -0.698461 -3.120037 -1.031909
H  0.172514 -0.78661 1.952162
H  -0.172526 -0.786623 -1.952175
H  1.215584 1.685694 1.981746
H  -1.215599 1.685681 -1.981775
H  4.056914 0.00999 -1.838943
H  -4.056928 0.009998 1.838923
H  2.893944 3.195833 0.891696
H  -2.893961 3.195825 -0.891737
H  4.313139 2.373951 -1.008062
H  -4.313156 2.373953 1.008026
