program: Gaussian 09
title: 000254062
version: EM64L-G09RevD.01
frameworkgroup: C1[X(C22H24O3)]
method: RPBEPBE
basis: SDD
operation: Freq
keyword: #pfreq=noraman
keyword: PBEPBE/SDD
title: #p freq=noraman PBEPBE/SDD
converged: YES YES NO NO
title: Mulliken charges:
elementType: O O O C C C C C C C C C C C C C C C C C C C C C C H H H H H H H H H H H H H H H H H H H H H H H H
charge: -0.161746 -0.270178 -0.239114 -0.309940 -0.293617 -0.354647 -0.582330 0.110086 0.528664 0.490243 0.234992 -0.378419 -0.454591 -0.415627 -0.389852 0.059255 -0.249800 -0.229248 -0.229750 -0.262308 -0.246566 -0.242792 -0.371231 -0.704820 -0.697659 0.270798 0.249671 0.301571 0.275161 0.262946 0.235913 0.233323 0.238909 0.241979 0.228962 0.225281 0.224746 0.226765 0.227770 0.228042 0.229636 0.208774 0.191007 0.220975 0.246357 0.212267 0.266223 0.203636 0.210280
chargesum: 0.00000
title: Mulliken charges with hydrogens summed into heavy atoms:
elementType: O O O C C C C C C C C C C C C C C C C C C C C C C
charge: -0.161746 -0.270178 -0.239114 -0.039142 -0.043946 -0.053076 -0.044223 0.110086 0.528664 0.490243 0.234992 -0.142506 -0.221268 -0.176717 -0.147873 0.288218 -0.024519 -0.004502 -0.002985 -0.034538 -0.018524 -0.013156 0.028551 -0.025221 -0.017520
polarizability: 2.50166372e+02 -1.99325087e+01 2.40537082e+02 1.25754465e+01 1.29027893e+01 2.10392747e+02
1716.lowfreq: -8.5901 -7.2511 -0.0006 0.0003 0.0005 5.5739 21.0038 24.1000 28.9288
frequency: 20.9472 23.8916 28.8095 33.6804 39.7727 54.4697 58.5647 71.3030 79.6505 110.8201 117.1324 145.9286 173.4015 179.3553 215.7868 221.1950 227.0994 234.6671 241.2673 272.7782 289.5712 344.3383 353.5801 391.1527 402.0271 405.0905 420.8549 436.7847 475.0973 497.1253 506.9170 519.4020 542.6890 587.9775 613.7647 617.7086 619.3530 650.4646 703.8915 704.6549 713.1626 726.9688 734.9336 741.6212 759.8577 789.2538 810.9646 815.9988 848.7970 850.5821 852.5403 862.3349 893.5742 918.9764 922.5637 944.6969 968.0600 974.6895 975.5523 979.8471 990.2839 991.7190 994.3444 995.4656 995.6732 1007.2971 1028.5584 1031.4208 1034.8115 1063.3584 1086.7805 1093.8669 1099.7243 1109.2678 1115.8044 1130.9307 1141.2643 1172.4299 1173.5339 1178.6574 1183.5644 1190.4648 1197.7726 1205.4557 1223.3960 1233.4210 1241.4935 1253.3505 1261.4671 1282.1686 1298.5870 1313.7796 1323.1606 1332.2346 1354.0967 1358.9298 1363.8269 1384.9674 1387.1139 1392.0734 1399.8346 1426.9550 1442.9283 1445.8219 1451.7172 1466.4042 1476.6376 1478.6560 1485.5783 1486.9007 1495.4715 1590.5398 1592.5345 1612.9993 1614.6354 1620.2162 1658.2962 2980.5607 2983.8245 2984.3986 2986.6812 2990.0513 3021.2922 3029.3809 3031.7816 3041.2510 3074.5148 3084.8717 3086.7955 3092.2724 3099.8558 3116.4673 3118.7906 3120.6072 3123.1020 3134.3736 3135.0516 3145.1384 3145.9466 3162.7972 3163.1261
redmass: 5.1185 3.6994 3.9378 4.5433 4.2474 6.1895 4.2760 4.7162 6.8851 2.7262 3.2107 4.6118 3.3691 3.3803 1.1246 3.3895 4.3557 1.7558 2.1957 3.7803 4.1623 4.1632 4.3729 3.2309 2.8091 2.8081 3.0833 3.7727 3.0190 3.3279 3.6398 3.9604 3.8021 4.1675 6.3311 6.1676 6.1101 6.0072 1.8218 1.7345 3.9858 4.5772 2.9406 2.1469 2.0550 2.3928 1.6420 3.2201 2.3197 1.2579 1.3139 2.7162 2.5625 1.5823 1.5267 4.0197 1.2932 1.4437 1.4410 3.1340 5.6062 5.5419 1.3884 1.3487 1.3178 2.2378 2.2086 2.1525 3.0440 2.3582 1.6195 2.5780 1.9935 2.2076 1.4860 2.2549 2.6901 1.0620 1.0568 1.9114 1.7439 1.2046 1.1327 1.2738 2.1369 1.5996 1.5934 1.6388 1.2615 1.4534 1.3085 1.5361 1.4100 1.3040 1.4811 1.6654 1.9287 4.8044 1.2254 3.0586 1.2075 1.1146 2.0502 2.0230 1.0779 1.0552 1.0475 1.0427 2.2559 2.3171 1.0513 5.8296 5.8615 6.0207 6.0831 9.8331 12.3656 1.0402 1.0541 1.0768 1.0728 1.0386 1.0887 1.0825 1.0858 1.0976 1.0993 1.0950 1.0987 1.1004 1.1008 1.0866 1.0855 1.0875 1.0861 1.0912 1.0913 1.0959 1.0960 1.1015 1.1015
irintensity: 0.6398 0.3991 0.2337 0.7256 0.9663 0.6541 0.0066 1.0816 2.5096 0.7049 0.1119 1.0877 4.7669 2.0291 0.1070 2.1673 0.7846 1.5779 0.2531 0.8356 6.6837 1.5976 1.3109 8.0142 0.0614 0.0741 1.0889 5.4413 1.1472 2.6038 15.3618 1.3304 12.2270 11.8663 1.2384 12.7911 1.4954 1.8913 60.6856 39.8687 12.9611 2.7577 17.1808 1.2614 11.1258 44.8917 31.9195 7.7880 0.8410 0.2749 1.1247 14.1282 3.1958 0.8553 3.0809 55.3229 12.2201 0.1081 0.6126 6.7184 0.4814 1.0194 52.8024 5.9692 0.8687 7.8709 16.7602 8.3693 13.4239 3.4499 36.1315 116.2796 162.0716 50.6634 15.9790 21.1476 53.8816 0.2640 0.0894 19.0663 21.7676 5.4414 0.2866 5.3549 7.3741 47.4038 26.1270 124.7994 17.9114 16.9507 0.8200 10.6121 9.6702 11.9156 5.9406 3.0843 4.3908 0.6339 16.0775 1.2559 17.3451 27.1350 8.7782 7.1502 2.4028 14.1196 3.0285 18.6529 16.7590 12.5130 15.8280 1.1994 2.2249 5.7121 4.5890 188.5532 162.4346 33.7167 21.4816 1.9884 12.0377 33.3912 1.9435 2.2471 21.2902 20.2902 43.3799 8.5069 30.1067 35.4024 22.1748 5.7369 7.7155 2.3450 1.4129 16.7074 13.0452 32.3470 43.6615 19.3810 23.2416
temp: 298.150 k
press: 1.00000 atm
elementType: 8 8 8 6 6 6 6 6 6 6 6 6 6 6 6 6 6 6 6 6 6 6 6 6 6 1 1 1 1 1 1 1 1 1 1 1 1 1 1 1 1 1 1 1 1 1 1 1 1
symmnumber: 1
zpe: 1055904.9 jmol-1
zpe.correction: 0.402173 hartree
zpe.thermalcorrener: 0.425888 hartree
zpe.thermalcorrenthalpy: 0.426833 hartree
zpe.thermalcorrgfe: 0.345859 hartree
zpe.sumelectzpe: -1076.607443 hartree
zpe.sumelectthermal: -1076.583727 hartree
zpe.sumelectthermalent: -1076.582783 hartree
zpe.sumelectthermalfe: -1076.663757 hartree
dipole: -1.9204 1.3376 -1.0703
dipole: 2.5735
quadrupole: -137.3272 -149.6855 -140.0297
quadrupole: 2.1843 -4.4875 0.5549
quadrupole: 5.0203 -7.3380 2.3178 2.1843 -4.4875 0.5549
hfenergy: -1077.0096159 hartree
pointgroup: C01 [X(C22H24O3)]
dipole: -0.5560756 0.8417481 0.0858059 debye
polarizability: 237.023079|-26.1757512|229.1925608|1.2084543|21.2009245|234.8805603 unknown
InChI: InChI=1S/C22H24O3/c1-3-15(2)25-22(24)21-19(23)14-18(16-10-6-4-7-11-16)20(21)17-12-8-5-9-13-17/h4-13,15,18,20-21H,3,14H2,1-2H3
charge 0 multiplicity 1
49 atoms
O  0.847335 -2.7156 -1.178742
O  2.850823 -0.100928 -0.628802
O  2.544612 -0.774527 1.589592
C  -0.348082 -0.23261 1.238881
C  -1.66078 -1.073411 0.90974
C  0.615227 -0.561082 0.071081
C  -1.055485 -2.400548 0.38916
C  0.221503 -2.007602 -0.360186
C  -0.542979 1.24416 1.547205
C  -2.61656 -0.401592 -0.075332
C  2.085738 -0.486568 0.45776
C  -0.761161 2.212961 0.532902
C  -0.520681 1.678878 2.897534
C  -3.656974 0.423785 0.42534
C  -2.502447 -0.553865 -1.482884
C  4.355916 -0.099717 -0.466875
C  -0.951354 3.573059 0.860462
C  -0.715853 3.037978 3.231117
C  -4.551905 1.081962 -0.445639
C  -3.393354 0.106468 -2.359633
C  -0.931924 3.992294 2.210962
C  -4.421746 0.928408 -1.845434
C  4.915071 -0.572984 -1.817004
C  4.784326 1.314918 -0.058347
C  4.536868 -2.030758 -2.154575
H  0.092689 -0.705962 2.139785
H  -2.205055 -1.232359 1.857912
H  0.457783 0.089391 -0.808895
H  -1.722371 -3.010807 -0.241405
H  -0.738039 -3.032733 1.244161
H  -0.794117 1.908778 -0.519575
H  -0.334576 0.946414 3.693067
H  -3.761438 0.555563 1.509179
H  -1.730002 -1.202611 -1.912561
H  4.591779 -0.822745 0.3369
H  -1.118459 4.304866 0.062047
H  -0.689515 3.351696 4.280838
H  -5.347603 1.712855 -0.033847
H  -3.288212 -0.028121 -3.442179
H  -1.078019 5.048495 2.463846
H  -5.11561 1.435914 -2.524817
H  4.551407 0.110778 -2.608527
H  6.017441 -0.46219 -1.778754
H  4.499019 2.048893 -0.83269
H  4.315554 1.606317 0.896867
H  5.881581 1.353375 0.070737
H  3.440654 -2.159845 -2.172423
H  4.947822 -2.731856 -1.40352
H  4.936458 -2.32308 -3.142428
