program: Gaussian 09
title: 000250105
version: EM64L-G09RevD.01
frameworkgroup: C1[X(C12H18O)]
method: RPBEPBE
basis: SDD
operation: Freq
keyword: #pfreq=noraman
keyword: PBEPBE/SDD
title: #p freq=noraman PBEPBE/SDD
converged: YES YES NO NO
title: Mulliken charges:
elementType: O C C C C C C C C C C C C H H H H H H H H H H H H H H H H H H
charge: -0.462632 -0.024619 -0.586825 0.490279 -0.704356 -0.704314 0.464917 -0.400112 -0.401906 -0.452173 -0.394290 -0.541504 -0.307937 0.197519 0.205896 0.205616 0.209239 0.231166 0.203677 0.208869 0.233009 0.204188 0.227428 0.227361 0.232185 0.197757 0.224748 0.272708 0.195362 0.202786 0.345958
chargesum: 0.00000
title: Mulliken charges with hydrogens summed into heavy atoms:
elementType: O C C C C C C C C C C C C
charge: -0.116674 0.172900 -0.175313 0.490279 -0.060274 -0.058248 0.464917 -0.172684 -0.174545 -0.227425 -0.121581 -0.111562 0.090211
polarizability: 1.71158101e+02 -1.04191847e-01 1.24245130e+02 5.19293672e+00 -1.22924232e+01 9.92762247e+01
1716.lowfreq: -20.0790 -4.7561 0.0001 0.0004 0.0006 7.2269 21.8816 39.1065 61.0793
frequency: 20.8666 38.9409 61.0329 82.0253 107.3169 139.6276 212.4280 220.4346 236.8864 250.0199 253.6869 310.6162 341.5025 372.7763 386.1886 408.5980 411.9528 454.9339 510.9592 608.2439 638.4683 689.4570 762.0248 769.7533 819.1032 839.1326 843.9088 856.9502 880.6013 920.5112 948.3310 953.2767 960.2008 962.1032 977.8538 999.6517 1016.6746 1044.2423 1074.8317 1086.0195 1121.9639 1162.4800 1180.0546 1192.3980 1198.2307 1219.6932 1223.2549 1224.2581 1257.9212 1269.7290 1315.5748 1328.8613 1340.4550 1347.9679 1376.1639 1381.2887 1393.2162 1398.1903 1410.6798 1453.0594 1464.1750 1465.3743 1473.8213 1474.1169 1483.3146 1489.0483 1506.7481 1578.5594 1622.9059 2938.8462 2955.2390 2968.1755 2970.2329 2978.1861 2983.8212 3002.5087 3027.4709 3045.7535 3060.7879 3065.4022 3069.0541 3075.7960 3104.7219 3117.6892 3130.8058 3161.5567 3573.1383
redmass: 3.4670 3.3810 3.4225 2.8473 4.0156 3.1142 2.3745 1.2200 2.1367 1.4015 1.0476 3.5820 2.4435 2.1856 1.9189 2.8378 2.5756 2.9643 2.8496 2.3503 6.3402 3.6730 3.2194 3.2381 3.0978 2.1279 1.8586 1.2972 1.5590 1.2078 1.5622 2.0504 1.5424 1.6941 1.3756 3.0576 2.8687 1.9147 1.6514 1.4869 1.3693 1.1193 2.0728 1.1074 1.4585 2.5344 1.5241 1.2666 1.2494 1.5183 1.3035 1.5011 1.5037 1.3958 1.2298 5.2138 1.2190 1.3614 2.5241 1.1085 1.0894 1.0507 1.0587 1.0859 1.0525 1.0549 2.6565 6.4569 6.4368 1.0560 1.0771 1.0350 1.0414 1.0605 1.0719 1.0947 1.1023 1.1007 1.0998 1.0987 1.1000 1.0991 1.0868 1.0893 1.0961 1.0948 1.0664
irintensity: 0.5016 0.0539 2.0001 1.0471 5.9440 9.0911 32.4981 0.5825 28.7845 89.6663 5.9193 2.3483 0.7907 0.9806 0.4235 0.9379 9.3194 6.9937 11.4748 23.9408 0.4290 2.0002 0.2358 6.6137 2.6835 20.0023 33.6439 10.9514 3.6949 1.3136 0.1533 2.7527 0.2994 0.0921 0.4077 40.6763 8.5287 20.9398 1.2080 4.5528 10.4615 12.9632 5.0402 0.9209 12.9821 4.0410 2.5227 0.6740 23.1216 17.6704 2.2646 1.5931 4.3421 6.6971 21.2043 2.0605 13.8783 3.3113 6.4526 12.1887 3.7141 3.8023 0.8509 3.6612 19.5179 17.8919 30.4220 0.1478 0.5057 86.8945 17.8965 44.1259 41.3812 57.0791 6.8797 108.4606 20.9243 22.7352 21.0293 68.6332 7.9131 96.2972 15.3228 23.6807 24.8040 3.9617 3.0973
temp: 298.150 k
press: 1.00000 atm
elementType: 8 6 6 6 6 6 6 6 6 6 6 6 6 1 1 1 1 1 1 1 1 1 1 1 1 1 1 1 1 1 1
symmnumber: 1
zpe: 706124.7 jmol-1
zpe.correction: 0.268949 hartree
zpe.thermalcorrener: 0.283191 hartree
zpe.thermalcorrenthalpy: 0.284136 hartree
zpe.thermalcorrgfe: 0.226689 hartree
zpe.sumelectzpe: -542.286244 hartree
zpe.sumelectthermal: -542.272001 hartree
zpe.sumelectthermalent: -542.271057 hartree
zpe.sumelectthermalfe: -542.328503 hartree
dipole: 0.4939 0.1273 1.8640
dipole: 1.9325
quadrupole: -70.8250 -75.8538 -80.0162
quadrupole: 0.7850 8.4100 0.1133
quadrupole: 4.7400 -0.2888 -4.4512 0.7850 8.4100 0.1133
hfenergy: -542.5551922 hartree
pointgroup: C01 [X(C12H18O1)]
dipole: -0.2127696 -0.2949887 0.6676721 debye
polarizability: 171.3655458|2.3115789|113.9107544|-3.0162503|17.3801011|109.4031551 unknown
InChI: InChI=1S/C12H18O/c1-10(2)9-12-5-3-11(4-6-12)7-8-13/h3-6,10,13H,7-9H2,1-2H3
charge 0 multiplicity 1
31 atoms
O  -3.781945 -1.72871 -0.425622
C  3.414654 -0.385335 0.199136
C  2.611153 0.648814 -0.662654
C  1.101066 0.634443 -0.465208
C  3.263909 -0.125505 1.716058
C  3.048939 -1.847271 -0.14865
C  -1.75285 0.596408 -0.085307
C  0.47956 1.457911 0.50873
C  0.262541 -0.201052 -1.250835
C  -0.921053 1.438481 0.695651
C  -1.136704 -0.223609 -1.067214
C  -3.26071 0.581648 0.12501
C  -3.813886 -0.746214 0.674374
H  4.482694 -0.231828 -0.066541
H  2.844572 0.45309 -1.728187
H  3.002659 1.658886 -0.428615
H  3.902664 -0.817592 2.296225
H  2.217667 -0.276238 2.039253
H  3.555967 0.908909 1.979783
H  3.677811 -2.553761 0.424965
H  1.991563 -2.05866 0.09394
H  3.199108 -2.055027 -1.225256
H  1.098695 2.128032 1.118323
H  0.714793 -0.835383 -2.023599
H  -3.79266 0.784858 -0.82498
H  -3.5444 1.385539 0.831189
H  -1.374483 2.092969 1.45143
H  -1.766395 -0.878927 -1.677018
H  -4.859924 -0.595246 1.018241
H  -3.199058 -1.089479 1.533029
H  -4.012848 -2.62545 -0.076552
