program: Gaussian 09
title: 000017987
version: EM64L-G09RevD.01
frameworkgroup: C1[X(C5H8ClN5)]
method: RPBEPBE
basis: SDD
operation: Freq
keyword: #p
keyword: freq=noraman
keyword: PBEPBE/SDD
title: #p freq=noraman PBEPBE/SDD
converged: NO YES NO NO
title: Mulliken charges:
elementType: Cl N N N N N C C C C C H H H H H H H H
charge: -0.021651 -0.332814 -0.332813 -0.103993 -0.022794 -0.022794 0.107054 0.107054 -0.601384 -0.601384 -0.273046 0.337827 0.337827 0.248008 0.247956 0.215491 0.248004 0.247961 0.215490
chargesum: 0.00000
title: Mulliken charges with hydrogens summed into heavy atoms:
elementType: Cl N N N N N C C C C C
charge: -0.021651 0.005013 0.005015 -0.103993 -0.022794 -0.022794 0.107054 0.107054 0.110071 0.110071 -0.273046
polarizability: 1.36794235e+02 -6.16659904e-05 1.24588488e+02 -1.92343650e-02 2.16020960e-03 4.94254266e+01
1716.lowfreq: -63.0026 -43.5637 -1.7330 -0.0007 0.0013 0.0019 3.1435 5.0204 99.0714
frequency: -62.6963 -43.5196 99.0711 100.2814 142.1218 178.6604 188.0213 221.4588 230.5494 275.6273 351.5712 477.3477 499.1322 551.1026 558.5276 613.9097 636.5185 645.2483 705.7409 792.7545 823.6011 890.0984 948.7902 1078.6318 1119.5651 1124.2270 1124.5789 1136.7546 1175.9897 1220.8455 1223.0870 1361.0029 1369.0511 1432.1866 1433.0381 1455.8879 1457.7026 1482.5869 1485.1987 1492.4990 1519.1076 1556.1027 1608.7590 2990.4423 2991.4627 3069.8004 3069.8580 3113.0260 3113.6190 3580.3239 3581.3417
redmass: 1.0248 1.0256 3.5256 4.7065 2.9802 8.4744 5.3271 6.3749 4.4748 4.3355 10.3543 6.2300 7.6256 1.2006 1.1040 4.2111 5.8248 8.6885 11.3425 11.5193 9.4519 12.7667 2.9426 1.7975 6.5928 1.2834 1.2832 3.7541 1.9448 4.1222 3.2766 3.4754 2.1843 1.2390 1.2843 1.0408 1.0407 1.7326 1.1263 1.1378 2.6843 5.4945 5.8592 1.0344 1.0345 1.1012 1.1013 1.1009 1.1008 1.0775 1.0777
irintensity: 0.0000 0.0392 0.0000 5.8656 1.4165 8.7319 0.5946 0.0001 0.3282 1.7820 23.3037 4.4464 3.4835 206.3196 0.0000 4.4031 0.9838 17.3813 0.0001 34.6246 55.0447 27.0422 8.1379 45.8628 0.4368 0.0004 3.7231 104.7422 3.6668 1.8039 96.9923 375.0190 15.2955 134.6742 13.7788 0.0002 29.1083 127.3267 22.5123 34.7464 38.4142 1242.3853 305.1860 19.2119 86.4074 0.0121 58.2261 48.2802 0.0657 154.5916 1.7163
temp: 298.150 k
press: 1.00000 atm
elementType: 17 7 7 7 7 7 6 6 6 6 6 1 1 1 1 1 1 1 1
symmnumber: 1
zpe: 372617.7 jmol-1
zpe.correction: 0.141923 hartree
zpe.thermalcorrener: 0.151779 hartree
zpe.thermalcorrenthalpy: 0.152723 hartree
zpe.thermalcorrgfe: 0.105905 hartree
zpe.sumelectzpe: -928.337575 hartree
zpe.sumelectthermal: -928.327719 hartree
zpe.sumelectthermalent: -928.326774 hartree
zpe.sumelectthermalfe: -928.373593 hartree
dipole: 5.6397 0.0000 0.0025
dipole: 5.6397
quadrupole: -73.0583 -54.1535 -72.6433
quadrupole: -0.0001 -0.0006 0.0002
quadrupole: -6.4400 12.4649 -6.0249 -0.0001 -0.0006 0.0002
hfenergy: -928.4794979 hartree
pointgroup: C01 [X(C5H8Cl1N5)]
dipole: -2.218837 0.0006857 0.0001784 debye
dipolederiv: -1.073337 0.0002875 0.0015632 0.0002848 -0.1354444 0.0000046 0.0043321 -0.0000012 -0.1036691 -0.6843132 -0.4829786 0.0002201 -0.6224602 -1.1929398 0.0000849 -0.0004754 -0.0003835 -0.4833997 -0.6836333 0.4826649 -0.0001364 0.6221494 -1.1936207 0.0002008 -0.0004348 0.00017 -0.4833986 -0.5659263 -0.000325 0.0001055 -0.0003274 -1.6254498 0.0002682 0.0003157 0.0002479 -0.2120485 -1.4253604 0.5659449 0.0004276 0.441676 -1.0923436 -0.0010512 0.0002843 0.0010416 -0.1761253 -1.4259779 -0.5657409 0.0006495 -0.4414696 -1.0917257 0.0013867 0.0004435 -0.0007028 -0.1761257 1.2172395 0.4720344 0.0002241 0.5409445 1.9054905 -0.0002603 0.000009 -0.0003043 0.2122054 1.2166191 -0.471612 0.000416 -0.5405203 1.9061116 -0.0003868 0.00015 -0.0002841 0.2122057 0.5312097 0.2189005 -0.0003515 0.0547656 0.2297453 0.0000641 -0.0000333 0.0003497 0.2345705 0.5310415 -0.2190862 0.0001163 -0.0549525 0.2299162 0.0000291 0.0001214 0. 0.2345701 2.1758158 -0.0002026 -0.003232 -0.000205 1.5057568 -0.0002623 -0.0047609 -0.0002348 0.0493244 0.0955785 -0.0370453 0.0000108 0.0164557 0.2733155 -0.0000104 -0.0000083 0.0000355 0.3392295 0.0955911 0.0371548 0.0000154 -0.0163463 0.2733032 0.0000445 0.000015 0.0000883 0.3392293 -0.0296437 -0.051392 -0.0465992 0.0722026 0.08422 0.0917769 -0.097376 0.0412994 -0.0604275 -0.0298477 -0.0517212 0.0466767 0.071913 0.0842664 -0.0916727 0.0975511 -0.0410895 -0.0608361 0.0571931 -0.0212591 0.0000386 -0.1017749 -0.164518 -0.0001975 0.0000176 -0.000208 0.1279793 -0.0296586 0.0515846 0.046626 -0.0719742 0.0842048 0.0917297 0.0974048 0.0411727 -0.0605418 -0.0298587 0.0516688 -0.0467628 -0.0719999 0.0843071 -0.091662 -0.0975728 -0.0410963 -0.0607215 0.0572686 0.0211225 -0.000008 0.1016388 -0.1645956 -0.0000862 0.000017 -0.0001005 0.1279793 unknown
polarizability: 136.794189|-0.0036422|124.5884855|-0.0655034|-0.0156049|49.4254747 unknown
InChI: InChI=1S/C5H8ClN5/c1-7-4-9-3(6)10-5(8-2)11-4/h7-8H,1-2H3
charge 0 multiplicity 1
19 atoms
Cl 3.582077 -0.001092 -0.003846
N  -0.861906 -2.353334 0.000433
N  -0.860455 2.353866 -0.000345
N  -0.955166 0.000295 0.000666
N  1.177272 1.211461 0.000729
N  1.176526 -1.212182 0.001148
C  -0.213982 -1.151803 0.000524
C  -0.213271 1.151938 0.000138
C  -2.321498 -2.484396 0.000682
C  -2.319966 2.485826 -0.000268
C  1.758133 -0.000539 0.002909
H  -0.259524 -3.176905 0.00032
H  -0.257567 3.177066 -0.000822
H  -2.763493 -2.003796 -0.890139
H  -2.763182 -2.005308 0.892486
H  -2.581292 -3.55505 -0.00017
H  -2.762064 2.005986 0.890911
H  -2.76214 2.006527 -0.891716
H  -2.579101 3.556642 0.000061
