program: Gaussian 09
title: 000250096
version: EM64L-G09RevD.01
frameworkgroup: C1[X(C12H14O2)]
method: RPBEPBE
basis: SDD
operation: Freq
keyword: #pfreq=noraman
keyword: PBEPBE/SDD
title: #p freq=noraman PBEPBE/SDD
converged: YES YES NO NO
title: Mulliken charges:
elementType: O O C C C C C C C C C C C C H H H H H H H H H H H H H H
charge: -0.266660 -0.277738 0.468339 -0.480776 -0.389087 -0.366718 0.232120 0.196688 -0.226833 -0.228973 -0.233408 -0.764171 -0.219637 -0.733812 0.219320 0.241317 0.232594 0.271282 0.226503 0.227773 0.228967 0.207189 0.245704 0.241262 0.252590 0.235352 0.224902 0.235911
chargesum: 0.00000
title: Mulliken charges with hydrogens summed into heavy atoms:
elementType: O O C C C C C C C C C C C C
charge: -0.266660 -0.277738 0.468339 -0.020139 -0.156493 -0.095436 0.232120 0.196688 -0.000330 -0.001200 -0.004440 -0.070016 0.032953 -0.037647
polarizability: 1.77662598e+02 -1.35063467e+01 1.34331133e+02 1.09464788e+01 -1.00032232e+00 9.60522310e+01
1716.lowfreq: -6.1547 -2.6642 -0.0009 -0.0007 0.0001 7.8651 29.1507 38.7952 41.6931
frequency: 29.0196 38.7875 41.6378 74.3254 112.9419 139.1136 153.8124 155.6385 214.4849 251.6552 272.7718 329.5044 371.3079 402.9247 406.0083 424.8327 463.0470 504.1911 593.3644 617.4940 638.3602 696.0251 705.3075 752.9605 761.3113 817.2043 857.8687 862.3540 893.8424 929.6303 939.4161 976.3618 983.3358 990.2370 1001.2411 1019.6276 1027.1663 1046.4513 1049.6803 1050.2606 1090.7227 1148.3386 1173.1317 1189.0081 1220.5078 1230.2634 1235.9862 1330.0734 1344.2885 1362.0575 1385.5586 1393.7790 1405.9262 1442.2661 1458.9944 1459.6614 1463.0180 1464.3918 1474.1217 1484.8008 1592.8930 1597.1970 1614.6616 1671.3976 2969.9852 2993.1705 3034.9170 3037.6521 3071.4737 3090.0931 3101.9754 3108.5024 3112.7727 3119.0173 3127.5509 3140.2345 3151.6046 3164.6347
redmass: 3.6995 4.5779 3.3128 6.6609 1.0472 1.0634 4.5463 3.8398 3.2392 5.0920 3.8677 2.9143 2.6174 3.0846 3.0555 3.0006 4.1517 4.7171 4.4343 6.3231 3.2000 4.1555 1.8924 3.1024 2.6252 3.5545 1.5935 2.5771 1.2532 1.8398 1.7856 1.8043 1.4167 5.2631 1.3434 1.7658 2.2055 1.4223 1.7896 2.0315 1.5199 2.9848 1.0540 1.1171 2.9177 2.1867 1.3739 1.2575 1.2644 1.4314 8.0450 1.3115 1.2615 2.1799 1.0637 1.1127 1.0602 1.0461 1.0909 2.2981 7.3102 7.7559 6.0629 6.3384 1.0385 1.0369 1.0582 1.0957 1.0972 1.0947 1.0980 1.1073 1.0923 1.0864 1.0875 1.0922 1.0963 1.1015
irintensity: 0.0322 1.6692 0.5024 2.6595 1.1798 0.2691 1.1164 1.2806 0.1427 4.9652 2.7010 0.6142 11.4968 0.0903 0.2738 0.2362 1.8323 19.1235 16.9570 0.3517 9.0141 22.3063 63.7374 32.9917 26.7477 9.6020 5.4670 13.7950 15.7060 57.5916 19.1490 13.9833 0.7817 0.2974 0.7529 6.7203 9.5106 0.3901 111.3936 234.2721 7.8515 85.1279 0.1290 1.4678 32.3698 149.7260 15.7181 1.8387 12.3904 5.0338 0.7516 15.6676 26.5855 9.2559 6.8589 20.7253 23.1112 24.6266 11.0352 10.7934 69.6075 76.1503 0.4247 51.0190 23.3461 18.5269 36.0327 17.9228 16.0902 9.5998 25.9209 5.3325 24.5366 5.3937 2.5808 22.3900 24.3644 21.2836
temp: 298.150 k
press: 1.00000 atm
elementType: 8 8 6 6 6 6 6 6 6 6 6 6 6 6 1 1 1 1 1 1 1 1 1 1 1 1 1 1
symmnumber: 1
zpe: 598444.7 jmol-1
zpe.correction: 0.227936 hartree
zpe.thermalcorrener: 0.242113 hartree
zpe.thermalcorrenthalpy: 0.243057 hartree
zpe.thermalcorrgfe: 0.185125 hartree
zpe.sumelectzpe: -615.083548 hartree
zpe.sumelectthermal: -615.069371 hartree
zpe.sumelectthermalent: -615.068427 hartree
zpe.sumelectthermalfe: -615.126359 hartree
dipole: 0.4939 1.0770 -1.2613
dipole: 1.7305
quadrupole: -68.3596 -78.8596 -83.5632
quadrupole: -0.9885 -0.8125 3.1235
quadrupole: 8.5679 -1.9321 -6.6357 -0.9885 -0.8125 3.1235
hfenergy: -615.3114839 hartree
pointgroup: C01 [X(C12H14O2)]
dipole: -0.1682379 -0.5281479 0.3953352 debye
polarizability: 178.9656296|-9.5916479|95.7480359|11.557942|-2.856774|133.3322975 unknown
InChI: InChI=1S/C12H14O2/c1-3-10(2)12(13)14-9-11-7-5-4-6-8-11/h3-8H,9H2,1-2H3
charge 0 multiplicity 1
28 atoms
O  -0.555225 0.473451 1.043034
O  -1.277911 1.258123 -1.035224
C  1.812636 0.496155 0.25136
C  0.698702 1.295685 0.89161
C  2.746622 -0.204234 1.056265
C  1.938769 0.440954 -1.161497
C  -2.662545 -0.329444 0.244908
C  -1.470958 0.540038 -0.018274
C  3.788465 -0.951813 0.463052
C  2.979193 -0.306893 -1.755392
C  3.906579 -1.004275 -0.945389
C  -2.690362 -1.132638 1.528684
C  -3.634011 -0.319419 -0.719895
C  -4.930194 -1.083968 -0.733016
H  0.937907 1.572169 1.930649
H  0.443833 2.189967 0.297298
H  2.655322 -0.164685 2.14889
H  1.210824 0.975514 -1.781925
H  4.506219 -1.487829 1.094154
H  3.069178 -0.34404 -2.84682
H  4.715341 -1.581847 -1.407424
H  -3.60486 -1.742108 1.610155
H  -1.815491 -1.804363 1.58914
H  -2.633462 -0.468172 2.409508
H  -3.443173 0.325539 -1.590713
H  -5.787054 -0.38609 -0.811751
H  -5.079565 -1.711285 0.160504
H  -4.980778 -1.73789 -1.625991
