program: Gaussian 09
title: 000254040
version: EM64L-G09RevD.01
frameworkgroup: C1[X(C21H23Cl2N)]
method: RPBEPBE
basis: SDD
operation: Freq
keyword: #p
keyword: freq=noraman
keyword: PBEPBE/SDD
title: #p freq=noraman PBEPBE/SDD
converged: YES YES NO NO
title: Mulliken charges:
elementType: Cl Cl N C C C C C C C C C C C C C C C C C C C C C H H H H H H H H H H H H H H H H H H H H H H H
charge: -0.073616 -0.069102 -0.263006 -0.086376 0.285938 0.309241 0.286313 -0.601221 0.149994 0.201120 -0.344869 -0.313993 -0.389152 -0.397627 -0.409438 -0.377445 -0.398460 -0.273096 -0.598595 -0.610627 -0.286749 -0.268353 -0.266338 -0.691282 0.254606 0.212776 0.249576 0.227690 0.219699 0.246163 0.229541 0.220578 0.258387 0.252986 0.228797 0.231274 0.232253 0.255193 0.286820 0.271905 0.262356 0.231410 0.231538 0.232150 0.213870 0.209955 0.227219
chargesum: 0.00000
title: Mulliken charges with hydrogens summed into heavy atoms:
elementType: Cl Cl N C C C C C C C C C C C C C C C C C C C C C
charge: -0.073616 -0.069102 -0.263006 -0.086376 0.285938 0.309241 0.286313 -0.133839 0.149994 0.201120 0.132397 0.151869 0.060966 -0.139240 -0.156452 -0.148648 -0.167186 -0.040844 -0.056583 -0.076366 -0.055339 -0.036816 -0.034188 -0.040238
polarizability: 3.23551645e+02 1.68868966e+01 2.95324208e+02 1.03031704e+01 3.32467623e+01 1.87860458e+02
1716.lowfreq: -4.5820 -3.7087 -0.0021 -0.0017 -0.0014 5.4431 23.3919 27.0481 30.2672
frequency: 23.3666 27.0264 30.2519 45.8968 52.5963 60.9800 76.7056 82.5665 97.5168 106.8057 122.3493 132.9944 177.5182 192.5719 198.2192 204.5233 215.5033 230.1447 242.7782 267.8206 279.7867 307.0163 349.0509 351.5503 398.7568 413.1094 428.3248 440.2140 464.8064 476.2892 514.9088 565.8912 580.2638 609.3709 613.8593 619.5453 657.6062 669.4618 687.3387 706.1758 739.5159 743.5275 760.5759 771.6274 774.9239 780.0176 788.6604 807.4089 826.0921 874.2733 882.5609 884.6154 917.2271 920.5717 958.2090 967.8590 990.6208 990.8356 993.8500 996.0117 1003.6420 1032.6980 1040.8699 1046.9034 1051.3731 1054.1482 1059.8358 1088.5696 1098.4644 1101.4885 1112.3029 1118.6222 1158.1324 1172.7199 1184.5591 1201.4774 1225.4752 1228.1966 1243.1057 1247.4050 1251.5283 1268.6341 1274.5503 1285.9012 1288.4535 1293.6284 1315.7893 1334.2117 1346.6350 1350.0103 1356.3497 1369.4609 1391.6548 1392.1874 1403.1793 1429.8832 1441.1957 1443.8869 1446.6937 1450.4690 1462.1984 1464.9856 1475.9378 1477.9226 1478.1728 1488.9477 1497.7571 1529.1626 1578.1954 1581.5004 1615.6277 1618.9550 2929.7774 2972.6093 2973.3060 2986.4569 2997.6918 3034.0026 3037.2190 3053.4966 3058.8742 3061.5430 3067.6759 3076.2315 3076.6590 3128.9594 3130.6656 3142.6268 3144.8637 3147.5717 3149.1319 3158.3458 3164.2421 3169.9577 3173.2644
redmass: 6.2760 8.3495 7.3139 5.6116 4.3240 3.9619 2.5563 2.9042 2.2767 3.4540 2.5812 2.5903 4.5905 7.3707 4.5394 3.8930 3.7700 1.2421 4.5103 3.3750 4.0651 3.3522 2.9555 4.6143 5.0565 4.9714 3.6578 3.5368 4.4644 3.7169 4.3967 3.5536 3.5103 5.3267 5.8573 5.7612 6.1072 5.3114 5.2816 2.9288 1.1953 2.2149 2.7285 1.1599 1.5842 1.4454 1.7692 2.7127 1.7116 1.5857 1.4876 2.2209 2.8429 3.1647 1.4103 1.3715 1.6399 3.7407 2.7254 1.3414 1.4683 1.9474 1.9988 2.9652 3.0629 2.8052 2.7897 2.1407 1.7697 1.9811 1.8870 1.5924 1.3659 1.0959 1.1070 2.4358 1.4994 1.6958 1.2643 1.5196 1.2219 1.5191 1.6417 1.2307 1.3810 1.1755 1.8850 1.4794 2.0119 1.6735 1.6190 1.4400 5.5811 1.2114 5.4949 2.6045 2.7301 2.4069 1.1714 1.1161 1.0980 1.1080 1.0480 1.3714 1.0732 1.5323 1.2486 3.4001 7.5622 7.9452 5.8668 6.3621 1.0691 1.0582 1.0362 1.0634 1.0623 1.0978 1.1043 1.0584 1.0572 1.0962 1.0910 1.1004 1.0990 1.0851 1.0855 1.0898 1.1120 1.0908 1.1110 1.0949 1.0924 1.0986 1.0977
irintensity: 0.1244 0.0475 0.1127 0.9194 0.1209 0.3782 2.3123 0.2108 0.3953 1.8107 0.5594 1.5438 3.7266 1.2696 6.5634 0.6032 2.4975 0.0599 0.2450 1.2218 0.0591 1.1460 0.2399 0.8299 10.7320 4.8805 7.4853 3.0815 1.0897 3.9051 6.8128 2.0957 0.7006 10.2075 1.2933 6.9286 89.3252 49.4808 45.5521 0.7199 6.4405 55.9350 10.7295 4.5513 66.8385 23.8322 22.9130 1.6847 0.8010 1.9028 1.9588 3.0351 2.7723 0.2374 0.3814 2.0884 3.5688 2.5678 20.8820 0.0965 1.8164 1.4958 10.5164 6.5048 0.6457 2.0503 1.1124 18.9263 9.2580 13.5157 12.1124 32.1452 10.9867 0.5407 0.3353 42.7939 1.0564 1.3944 20.0757 2.0230 1.7809 15.6377 19.3116 1.3731 1.9437 8.2879 3.0754 4.9975 7.6345 8.5305 13.7295 5.1335 0.9353 12.5662 12.0554 14.0702 11.2496 1.8862 2.7331 3.9959 7.3932 14.3509 10.8007 7.2559 3.0241 18.4257 19.2696 0.7503 2.8291 10.5474 0.0239 0.5320 46.0580 14.5474 44.9433 6.8647 42.2097 1.1122 19.8178 13.7769 16.8680 7.0657 17.9865 67.0272 49.6204 0.2374 1.0281 17.1904 15.6475 12.4735 17.8374 0.3469 34.3805 53.6686 19.6032
temp: 298.150 k
press: 1.00000 atm
elementType: 17 17 7 6 6 6 6 6 6 6 6 6 6 6 6 6 6 6 6 6 6 6 6 6 1 1 1 1 1 1 1 1 1 1 1 1 1 1 1 1 1 1 1 1 1 1 1
symmnumber: 1
zpe: 1009643.9 jmol-1
zpe.correction: 0.384553 hartree
zpe.thermalcorrener: 0.407933 hartree
zpe.thermalcorrenthalpy: 0.408877 hartree
zpe.thermalcorrgfe: 0.329083 hartree
zpe.sumelectzpe: -1787.177362 hartree
zpe.sumelectthermal: -1787.153982 hartree
zpe.sumelectthermalent: -1787.153038 hartree
zpe.sumelectthermalfe: -1787.232832 hartree
dipole: 3.1826 0.3033 -0.4400
dipole: 3.2272
quadrupole: -156.8267 -145.3067 -175.4562
quadrupole: 2.0749 0.4266 12.3329
quadrupole: 2.3698 13.8898 -16.2596 2.0749 0.4266 12.3329
hfenergy: -1787.5619149 hartree
pointgroup: C01 [X(C21H23Cl2N1)]
dipole: -1.2081488 0.1316267 0.3675867 debye
polarizability: 320.2503013|-19.7092897|306.8223827|-14.3027338|3.2900404|179.6636269 unknown
InChI: InChI=1S/C21H23Cl2N/c1-2-7-19-17-9-4-3-8-16(17)18-10-5-6-11-20(18)21(19)24(14-12-22)15-13-23/h3-6,8-11H,2,7,12-15H2,1H3
charge 0 multiplicity 1
47 atoms
Cl 3.22064 -0.420869 -4.292638
Cl 5.055324 0.194536 2.276789
N  1.867466 0.140598 -0.393331
C  0.44406 0.001902 -0.145295
C  -0.383869 1.128294 -0.082656
C  -0.096995 -1.343766 0.028526
C  -1.823493 0.955495 0.106988
C  0.19625 2.532498 -0.188568
C  -1.509712 -1.531501 0.245927
C  -2.389188 -0.361908 0.270989
C  2.304217 0.425604 -1.774991
C  2.749327 0.555878 0.714503
C  0.2951 3.271529 1.179947
C  0.758231 -2.489373 -0.00193
C  -2.705207 2.085194 0.124525
C  -1.997695 -2.862917 0.424581
C  -3.802287 -0.482738 0.447805
C  0.253042 -3.781931 0.175615
C  2.665263 -0.864696 -2.532758
C  3.916916 -0.429013 0.894626
C  -4.085776 1.937233 0.296866
C  -1.140555 -3.970114 0.391297
C  -4.640147 0.638476 0.463508
C  0.852603 4.701801 1.024296
H  1.208934 2.49013 -0.623175
H  -0.410412 3.149478 -0.880035
H  1.508735 0.951409 -2.338206
H  3.188343 1.093342 -1.754594
H  3.163722 1.57648 0.554494
H  2.159261 0.582553 1.646418
H  -0.700008 3.304445 1.662024
H  0.946832 2.689139 1.858892
H  1.826861 -2.326607 -0.164264
H  -2.297187 3.090476 -0.009883
H  -3.064217 -3.035485 0.593793
H  -4.253295 -1.471287 0.570361
H  0.926064 -4.645902 0.150488
H  3.514879 -1.398175 -2.080378
H  1.801981 -1.534388 -2.65387
H  3.576559 -1.425286 1.211662
H  4.558475 -0.495569 0.002657
H  -4.737333 2.817656 0.300897
H  -1.543357 -4.978925 0.532245
H  -5.719964 0.514659 0.599206
H  1.859795 4.690109 0.566325
H  0.198894 5.318038 0.378262
H  0.933721 5.207999 2.00316
