program: Gaussian 09
title: 000253986
version: EM64L-G09RevD.01
frameworkgroup: C1[X(C19H30Cl2N2O2)]
method: RPBEPBE
basis: SDD
operation: Freq
keyword: #p
keyword: freq=noraman
keyword: PBEPBE/SDD
title: #p freq=noraman PBEPBE/SDD
converged: YES YES NO NO
title: Mulliken charges:
elementType: Cl Cl O O N N C C C C C C C C C C C C C C C C C C C H H H H H H H H H H H H H H H H H H H H H H H H H H H H H H
charge: -0.059759 -0.059322 -0.271225 -0.251154 -0.302084 -0.172970 -0.428095 -0.208364 -0.001967 -0.621558 -0.720905 -0.725852 0.265590 0.491034 0.445135 -0.403467 -0.426158 -0.369868 -0.376078 -0.389377 -0.389296 -0.584150 -0.584733 -0.261548 -0.666477 0.229396 0.203370 0.246816 0.209845 0.271183 0.227373 0.222342 0.212792 0.218377 0.203523 0.210640 0.207365 0.228151 0.227788 0.228835 0.231028 0.231761 0.247998 0.248892 0.247957 0.249016 0.292533 0.268222 0.292616 0.268273 0.235320 0.221465 0.224845 0.248986 0.215943
chargesum: 0.00000
title: Mulliken charges with hydrogens summed into heavy atoms:
elementType: Cl Cl O O N N C C C C C C C C C C C C C C C C C C C
charge: -0.059759 -0.059322 -0.271225 -0.251154 -0.030901 -0.172970 0.004672 0.038452 0.207878 -0.171844 -0.086214 -0.079696 0.265590 0.491034 0.445135 -0.175679 -0.197323 -0.138840 -0.144317 0.107513 0.107677 -0.023396 -0.023845 0.195237 0.023297
polarizability: 3.24780250e+02 -9.26549740e+00 2.47186658e+02 -2.61310760e+01 -1.66310042e+01 1.95693079e+02
1716.lowfreq: -16.5679 -7.3661 -4.2067 -1.4314 -0.0014 -0.0012 -0.0008 10.2635 12.8164
frequency: -12.1458 8.9619 12.3988 21.9717 29.2043 34.7560 38.2070 42.9118 56.6749 58.2901 66.4719 87.1106 90.9672 100.5781 128.8878 133.6191 143.5348 176.1626 204.6818 206.6733 214.3597 215.8926 229.8313 238.8719 244.3128 249.6824 287.7461 294.5374 318.1970 330.1186 345.1184 364.9866 378.2857 393.9942 410.9632 426.7039 433.4917 460.4561 484.6975 507.4317 527.0758 533.8767 568.3924 635.9520 657.1923 664.7273 692.3243 700.6633 715.2333 741.4739 767.4965 779.7643 787.7874 795.8834 811.9029 812.1446 817.5265 829.5603 838.7330 903.1301 916.1977 931.5835 945.3158 950.1699 950.6684 956.1359 958.8421 996.2238 997.5580 1008.0831 1026.7850 1034.1041 1034.4607 1040.2723 1041.4635 1093.1274 1099.6198 1118.4127 1122.6350 1131.8888 1142.3982 1146.3506 1155.7528 1175.0417 1177.3716 1198.3637 1216.5926 1221.8496 1223.4270 1238.7152 1254.8469 1255.3295 1275.1112 1277.6280 1289.4330 1292.3832 1309.8395 1324.5116 1330.0163 1336.0805 1337.6789 1348.8194 1352.5541 1356.2074 1363.0546 1375.8557 1379.2338 1385.8871 1389.1897 1392.7235 1426.3587 1444.0734 1447.8246 1456.1842 1457.8721 1458.1427 1460.3464 1463.7137 1467.2678 1471.1497 1479.8961 1482.4012 1484.6359 1493.3526 1504.7899 1514.3412 1570.2204 1626.0432 1638.5615 2959.4145 2963.7264 2966.4817 2974.3079 2978.2411 2990.9559 3012.0244 3017.8087 3028.7246 3036.5753 3037.7715 3055.5189 3060.4377 3062.5866 3062.8992 3064.3438 3067.8174 3068.0129 3071.0494 3073.9637 3085.7698 3091.5389 3109.9573 3112.4042 3117.5975 3146.6305 3147.4779 3152.8619 3157.6436 3496.2802
redmass: 4.9882 4.8647 5.7643 4.9256 11.1997 3.9477 5.9885 3.8374 2.9248 3.1608 4.2748 4.6016 3.5910 2.9148 2.7756 3.9618 4.9168 2.0197 4.9221 1.2144 2.1747 4.9030 1.4424 4.3302 2.7805 1.4998 2.6527 2.5878 3.0265 3.1394 3.2783 3.0740 3.1484 2.2680 3.0065 2.5232 2.8114 3.7997 2.0285 2.8418 2.7950 2.8237 3.1659 6.8008 5.4952 3.2069 5.1348 3.6691 6.2838 3.8645 2.0871 1.1279 1.2345 2.7870 1.2843 1.6667 2.4056 2.1837 2.4645 1.7240 1.1932 1.6074 1.6794 1.7478 1.6949 1.8922 1.7603 1.4790 2.8292 2.6213 2.6107 2.5655 3.1074 2.2486 3.3344 2.3097 2.0354 1.5187 2.5710 1.7732 2.8020 1.7381 1.6907 1.8110 1.7876 1.4225 1.3345 2.0559 1.8795 1.3879 1.1634 1.1624 1.3453 1.1194 1.3051 1.1949 1.3410 1.3370 1.3578 1.3898 1.3180 1.3085 1.3124 1.4005 1.5354 1.4862 2.2797 1.7288 1.2348 1.2116 3.0396 1.1104 1.0902 1.0982 1.0956 1.0942 1.1830 1.0424 1.0554 1.0483 1.0565 1.0896 1.0515 1.0501 1.1521 2.3524 6.4512 6.2656 8.5283 1.0824 1.0363 1.0379 1.0583 1.0604 1.0359 1.0602 1.0608 1.0592 1.1000 1.1012 1.0991 1.0908 1.0574 1.0588 1.0971 1.0981 1.1013 1.0986 1.1034 1.0976 1.1030 1.0890 1.0889 1.1063 1.1114 1.1117 1.0932 1.0935 1.0755
irintensity: 0.0428 0.3110 0.0546 1.0222 0.8646 0.5379 0.7047 0.3539 0.5842 0.5891 0.6002 1.1716 0.5103 0.8787 0.8801 2.3589 1.0635 2.8311 2.9538 0.5793 2.2955 0.3414 1.5925 14.2330 1.7842 1.4167 1.8343 6.9674 14.2917 5.9932 4.6065 5.9784 3.5117 5.7428 1.2850 2.8141 9.0967 5.5178 40.9214 10.1569 81.9923 89.7610 39.7701 1.9912 55.1187 15.5039 83.2080 14.2080 17.6739 7.6651 11.8584 2.7656 7.8127 39.1327 2.3999 1.5228 2.2904 45.8390 2.5945 5.5824 2.7025 11.3882 13.1644 8.8282 1.9433 11.1260 1.0724 2.8580 1.6787 19.1734 7.9246 0.6850 3.1893 1.9201 124.9305 141.0179 40.9460 48.8495 35.3618 8.7474 167.4867 7.3182 27.7542 4.6898 98.4104 14.4679 4.6995 33.1175 8.0204 20.5296 19.4883 17.2676 39.2247 3.4437 2.8473 8.7051 6.7969 25.3256 4.2132 3.5635 14.5356 5.7820 15.2071 41.3628 12.2312 7.0776 10.0517 49.8038 22.5323 15.3693 2.3290 4.0707 6.1294 16.5557 17.8018 2.7982 17.7473 15.4706 2.2843 5.7282 4.1494 25.2411 17.5476 24.4604 2.4714 222.9492 5.5716 159.1253 134.6081 17.7604 31.6014 25.5891 24.7054 55.0005 20.1441 26.1815 14.5516 35.3308 15.1717 9.0315 6.4090 12.9951 7.5154 22.2648 109.4442 22.7677 18.8064 51.7966 11.2139 41.2155 2.2129 11.1692 24.0369 32.3442 4.0566 18.8170 29.4943 13.4561 3.4862
temp: 298.150 k
press: 1.00000 atm
elementType: 17 17 8 8 7 7 6 6 6 6 6 6 6 6 6 6 6 6 6 6 6 6 6 6 6 1 1 1 1 1 1 1 1 1 1 1 1 1 1 1 1 1 1 1 1 1 1 1 1 1 1 1 1 1 1
symmnumber: 1
zpe: 1210898.2 jmol-1
zpe.correction: 0.461207 hartree
zpe.thermalcorrener: 0.489622 hartree
zpe.thermalcorrenthalpy: 0.490567 hartree
zpe.thermalcorrgfe: 0.396134 hartree
zpe.sumelectzpe: -1920.128006 hartree
zpe.sumelectthermal: -1920.099590 hartree
zpe.sumelectthermalent: -1920.098646 hartree
zpe.sumelectthermalfe: -1920.193078 hartree
dipole: 0.0225 0.7610 -0.9346
dipole: 1.2055
quadrupole: -171.8851 -178.8559 -168.1743
quadrupole: 8.2536 -3.4110 4.4444
quadrupole: 1.0867 -5.8841 4.7975 8.2536 -3.4110 4.4444
hfenergy: -1920.5892123 hartree
pointgroup: C01 [X(C19H30Cl2N2O2)]
dipole: -0.0549647 -0.3017292 -0.3617594 debye
polarizability: 315.8708075|-23.1134162|254.3850423|33.8788515|8.6964982|197.4041369 unknown
InChI: InChI=1S/C19H30Cl2N2O2/c1-4-25-19(24)18(13-15(2)3)22-14-16-5-7-17(8-6-16)23(11-9-20)12-10-21/h5-8,15,18,22H,4,9-14H2,1-3H3
charge 0 multiplicity 1
55 atoms
Cl 6.753693 1.038513 1.337884
Cl 3.154358 -5.113811 -0.591532
O  -5.113931 0.779747 -1.21023
O  -4.839749 2.222709 0.606895
N  -2.194235 2.319075 -0.874805
N  3.474178 -0.992977 -0.198384
C  -2.306431 0.568329 0.972516
C  -2.862714 1.097393 -0.378056
C  -2.971682 -0.729326 1.505442
C  -1.125887 2.180762 -1.888969
C  -2.377387 -1.090062 2.887802
C  -2.818426 -1.912349 0.518024
C  -4.352793 1.438413 -0.240964
C  0.103035 1.36342 -1.478219
C  2.36751 -0.2182 -0.623134
C  1.081948 1.888483 -0.597408
C  0.291588 0.035988 -1.932034
C  2.189825 1.128968 -0.1773
C  1.38778 -0.747642 -1.516443
C  4.452771 -0.468359 0.767713
C  3.690037 -2.359256 -0.701951
C  5.534863 0.366418 0.055896
C  2.871323 -3.380278 0.111579
C  -6.582688 1.073165 -1.219383
C  -7.325951 0.153595 -0.246163
H  -1.219544 0.397914 0.845699
H  -2.433135 1.372465 1.726429
H  -2.765668 0.324859 -1.159332
H  -4.056124 -0.532283 1.644778
H  -2.009339 3.007164 -0.137642
H  -0.819531 3.207702 -2.16635
H  -1.573067 1.728618 -2.795607
H  -2.862883 -1.989528 3.310362
H  -2.507294 -0.261737 3.609123
H  -1.292871 -1.298949 2.803649
H  -3.219224 -2.844254 0.958682
H  -1.750463 -2.082386 0.276831
H  -3.360079 -1.733233 -0.428522
H  0.982296 2.91868 -0.230866
H  -0.435946 -0.40389 -2.62652
H  2.917774 1.59699 0.492335
H  1.468663 -1.770467 -1.896792
H  4.935224 -1.312305 1.291766
H  3.956473 0.141072 1.543747
H  4.762242 -2.612048 -0.622778
H  3.42791 -2.433345 -1.77238
H  5.11938 1.246495 -0.455222
H  6.13532 -0.236287 -0.641724
H  1.788895 -3.200224 0.044728
H  3.190064 -3.42765 1.163521
H  -6.726718 2.136076 -0.957362
H  -6.876215 0.894119 -2.266197
H  -7.123946 -0.907528 -0.473951
H  -7.02402 0.361429 0.794049
H  -8.415712 0.323111 -0.329529
