program: Gaussian 09
title: 000253910
version: EM64L-G09RevD.01
frameworkgroup: C1[X(C13H18N2O2)]
method: RPBEPBE
basis: SDD
operation: Freq
keyword: #p
keyword: freq=noraman
keyword: PBEPBE/SDD
title: #p freq=noraman PBEPBE/SDD
converged: YES YES NO NO
title: Mulliken charges:
elementType: O O N N C C C C C C C C C C C C C H H H H H H H H H H H H H H H H H H
charge: -0.179824 -0.207389 -0.189827 -0.448836 -0.328622 -0.316928 -0.483338 -0.676378 -0.666468 0.195355 0.190222 0.236126 -0.327443 -0.336332 -0.247387 -0.224005 -0.226640 0.205658 0.232888 0.204020 0.210064 0.247976 0.247777 0.229722 0.209945 0.224883 0.216600 0.217665 0.220562 0.379541 0.213713 0.278174 0.230149 0.234614 0.233760
chargesum: 0.00000
title: Mulliken charges with hydrogens summed into heavy atoms:
elementType: O O N N C C C C C C C C C C C C C
charge: -0.179824 -0.207389 -0.189827 -0.069295 0.109924 0.097156 0.012416 -0.011827 -0.011640 0.195355 0.190222 0.236126 -0.113730 -0.058158 -0.017238 0.010609 0.007119
polarizability: 2.05960003e+02 1.24920583e+01 1.75602346e+02 -8.06669098e+00 7.21568252e+00 1.05968776e+02
1716.lowfreq: -8.9712 -6.3677 -5.3243 0.0005 0.0007 0.0008 14.9086 29.7035 38.3867
frequency: 14.8143 29.6515 38.3689 49.4933 62.5025 82.8925 90.2706 121.5364 144.9881 186.3858 206.0830 223.5276 237.8805 260.7570 288.8297 307.0447 345.5794 399.1324 401.7051 428.1251 444.9791 467.1870 519.2777 528.9591 570.8298 614.1791 675.8984 689.5969 703.7999 757.2747 796.7299 800.7879 803.6842 842.9732 851.6029 885.5877 906.0661 932.6929 944.4635 984.5326 987.7018 989.3992 996.5366 1010.6815 1024.9576 1062.9773 1073.4714 1080.5406 1088.4281 1089.5801 1111.2559 1151.6991 1161.1594 1173.7873 1197.5230 1199.4273 1244.3992 1251.1922 1279.7251 1289.8973 1321.8610 1326.7024 1364.8602 1368.8701 1386.2681 1393.2156 1395.8922 1432.9358 1445.3679 1450.4707 1468.5744 1469.7523 1475.1547 1479.5058 1483.6747 1484.4333 1492.3236 1577.8698 1608.2943 1612.4381 1670.7505 2901.3402 2907.1579 2963.2932 2985.1114 2986.6737 3028.5760 3045.6005 3049.5725 3081.8730 3084.0905 3086.4083 3086.7352 3118.1574 3132.3377 3145.2378 3157.7667 3169.5926 3219.8795
redmass: 3.8653 3.5172 4.0537 3.8692 5.6774 2.1851 2.0212 4.3027 3.1192 2.8989 1.3905 1.9694 7.9923 2.4494 1.9257 3.4593 3.2282 3.2325 3.0259 4.2344 2.7307 4.5636 4.3002 4.4725 3.4316 6.4301 5.8591 3.8463 1.5451 2.4012 1.1578 2.5768 1.3169 5.4120 1.2671 1.8963 2.9623 1.5774 1.3258 2.0166 1.3930 4.9585 2.3771 1.3478 2.5260 2.5204 1.9141 2.3831 1.9728 2.2671 1.9933 2.1817 1.8144 1.0635 1.2317 2.1267 1.5510 2.9596 1.1889 1.1887 1.3453 1.3579 1.3301 1.3646 8.8980 1.2312 1.2276 2.2283 1.0964 1.9532 1.0512 1.0607 1.0835 1.0691 1.9517 1.0804 1.1042 6.2101 5.6749 6.0565 9.6541 1.0713 1.0703 1.0653 1.0359 1.0360 1.0909 1.0896 1.0951 1.0988 1.0984 1.1004 1.1002 1.0874 1.0873 1.0919 1.0956 1.1007 1.0766
irintensity: 0.0289 0.4144 2.2409 1.4802 2.1270 1.1149 0.2063 1.2112 0.5558 0.3816 0.4783 6.4481 0.0419 8.3821 1.2358 1.3543 2.2349 0.5083 0.1534 2.1814 2.5318 4.5027 0.6029 55.5110 0.4779 0.4873 2.7085 0.2621 102.4558 22.3213 3.6101 11.0118 3.2111 12.3059 6.4984 7.9119 3.9287 18.9740 31.8850 11.6049 0.9657 3.4604 12.9670 1.6828 7.4359 28.8500 21.1394 8.9975 11.5834 10.6456 20.1602 39.3449 13.9945 2.1323 37.2741 21.5482 44.3558 152.7729 7.5530 18.9600 14.2389 2.2895 8.1968 53.6486 1.0481 15.7505 23.5205 65.3355 9.3406 843.8939 2.2368 36.2519 6.6175 9.5679 84.3801 11.1569 76.9785 25.6595 25.0827 1.7537 313.2497 24.2979 158.5612 44.3262 21.9402 17.1104 9.1830 6.7913 11.6569 21.0784 60.2997 62.8191 41.0907 10.7623 2.7469 22.4863 13.4509 23.6117 287.1231
temp: 298.150 k
press: 1.00000 atm
elementType: 8 8 7 7 6 6 6 6 6 6 6 6 6 6 6 6 6 1 1 1 1 1 1 1 1 1 1 1 1 1 1 1 1 1 1
symmnumber: 1
zpe: 759411.1 jmol-1
zpe.correction: 0.289244 hartree
zpe.thermalcorrener: 0.306911 hartree
zpe.thermalcorrenthalpy: 0.307855 hartree
zpe.thermalcorrgfe: 0.240827 hartree
zpe.sumelectzpe: -764.855735 hartree
zpe.sumelectthermal: -764.838068 hartree
zpe.sumelectthermalent: -764.837124 hartree
zpe.sumelectthermalfe: -764.904152 hartree
dipole: 1.8988 -7.7534 0.1909
dipole: 7.9848
quadrupole: -83.1656 -120.3716 -100.4186
quadrupole: -0.6107 -1.0444 1.6456
quadrupole: 18.1530 -19.0530 0.9000 -0.6107 -1.0444 1.6456
hfenergy: -765.1449795 hartree
pointgroup: C01 [X(C13H18N2O2)]
dipole: -1.281897 -0.7208032 2.7759525 debye
polarizability: 198.6513406|-20.2547321|110.6412274|12.5967525|-14.5048656|178.2385569 unknown
InChI: InChI=1S/C13H18N2O2/c1-3-15(4-2)10-12(16)14-13(17)11-8-6-5-7-9-11/h5-9,14H,3-4,10H2,1-2H3
charge 0 multiplicity 1
35 atoms
O  -1.226856 1.497434 -3.671078
O  1.567507 0.823911 -2.851805
N  -2.786479 0.477574 -0.486821
N  -0.387337 0.81029 -1.545769
C  -3.071953 -0.978878 -0.698847
C  -3.659728 1.107265 0.550123
C  -2.770371 1.217826 -1.777087
C  -2.586417 -1.870292 0.458137
C  -3.051026 2.388303 1.148109
C  -1.379207 1.183989 -2.46694
C  1.004945 0.680587 -1.733212
C  1.787766 0.339113 -0.484962
C  1.248003 0.366212 0.829502
C  3.151183 -0.013635 -0.662863
C  2.058044 0.040968 1.939336
C  3.957824 -0.342004 0.444939
C  3.412961 -0.317304 1.750989
H  -4.160844 -1.142242 -0.88001
H  -2.547536 -1.281593 -1.624451
H  -4.673134 1.322717 0.135452
H  -3.800417 0.369106 1.359221
H  -3.515125 0.841432 -2.509596
H  -3.006498 2.283219 -1.600467
H  -1.501605 -1.740308 0.621849
H  -3.106987 -1.650306 1.407296
H  -2.772936 -2.932542 0.217236
H  -2.076206 2.171312 1.620407
H  -2.892517 3.17243 0.385838
H  -3.725055 2.806567 1.917838
H  -0.841489 0.588953 -0.634545
H  0.207398 0.660405 1.012275
H  3.549888 -0.015673 -1.682712
H  1.635237 0.072288 2.949541
H  5.007822 -0.614786 0.29374
H  4.03904 -0.56964 2.614037
