program: Gaussian 09
title: 000253897
version: EM64L-G09RevD.01
frameworkgroup: C1[X(C15H14S)]
method: RPBEPBE
basis: SDD
operation: Freq
keyword: #pfreq=noraman
keyword: PBEPBE/SDD
title: #p freq=noraman PBEPBE/SDD
converged: YES YES NO NO
title: Mulliken charges:
elementType: S C C C C C C C C C C C C C C C H H H H H H H H H H H H H H
charge: 0.231691 0.442760 -0.191791 -0.389620 -0.373059 -0.175377 -0.263541 0.484055 -0.803371 -0.186495 -0.391947 -0.390646 -0.580336 -0.234777 -0.230379 -0.244175 0.232572 0.232810 0.260044 0.246292 0.225759 0.225612 0.236416 0.234311 0.228558 0.224008 0.269607 0.226669 0.225014 0.229338
chargesum: 0.00000
title: Mulliken charges with hydrogens summed into heavy atoms:
elementType: S C C C C C C C C C C C C C C C
charge: 0.231691 0.442760 -0.191791 -0.157048 -0.140249 0.084667 -0.017249 0.484055 -0.115585 0.047816 -0.163389 -0.166638 -0.310729 -0.008108 -0.005365 -0.014837
polarizability: 3.42875758e+02 9.67945348e+00 1.61609602e+02 -2.12057320e+01 5.45493495e+00 1.04859975e+02
1716.lowfreq: -19.9116 -0.0018 -0.0014 0.0005 1.3848 3.5894 12.6252 22.2931 31.6835
frequency: -19.7120 22.2511 31.5987 38.1690 86.3960 103.6123 124.8388 191.6543 207.4274 250.3263 290.1248 310.7673 363.9759 373.8817 404.2895 405.8005 434.5811 490.8932 507.5388 575.4733 607.0908 616.2530 632.0141 695.6054 706.7801 756.1258 784.6187 789.4670 814.8184 822.9356 842.0379 843.5569 849.2717 914.6239 947.6430 960.2614 971.0935 975.3388 986.5347 987.6619 994.7259 1003.8460 1026.3355 1047.1009 1073.6145 1082.9208 1120.0674 1172.2487 1189.8958 1191.4539 1215.4912 1221.6071 1245.1812 1289.9194 1299.9537 1332.9769 1361.9892 1383.3406 1398.0008 1398.5009 1438.0127 1470.8851 1474.3089 1482.0859 1483.2659 1576.1628 1579.7642 1607.3014 1609.8265 1616.0345 2975.3959 3056.5932 3086.1133 3099.6551 3118.3253 3121.4896 3123.6001 3124.2516 3136.7505 3139.7536 3146.8478 3148.3015 3151.7274 3164.9061
redmass: 1.0222 3.9673 4.4289 4.1921 4.0221 4.3098 4.3554 3.1951 4.9184 3.9201 4.3873 4.5454 3.2403 7.7637 2.7824 2.9071 4.1782 2.7115 3.0242 6.7046 5.8572 6.4409 6.9514 1.7675 3.3328 1.6473 5.5413 5.7353 1.4170 1.8095 1.2779 2.9074 1.4372 1.4179 1.2937 1.2039 1.3488 1.3994 1.4077 5.8154 1.3211 3.9678 2.1891 1.5568 3.1114 1.6033 1.3084 1.0626 1.1187 1.1136 1.4884 2.9568 1.7517 1.4227 1.2969 1.2651 4.8589 6.6620 3.2571 1.2399 2.3399 1.0909 1.0537 2.4376 2.2794 6.1149 5.8258 6.1481 6.0457 6.0465 1.0389 1.0947 1.0998 1.0902 1.0868 1.0881 1.0881 1.0862 1.0914 1.0916 1.0955 1.0958 1.0969 1.1015
irintensity: 0.6795 0.7293 0.3445 0.2989 2.2209 1.0988 0.7637 2.2604 2.0426 0.6449 3.0796 0.7615 1.5386 0.1482 0.0961 0.6241 2.8078 23.6549 16.4036 14.8321 15.6611 0.1702 0.0450 37.5902 5.5741 83.8761 26.6003 5.4024 60.9925 11.0653 0.6605 10.9330 0.0551 3.8590 7.9305 70.2329 5.8880 1.9227 0.6529 0.4569 3.6033 24.7424 4.4075 20.1876 21.4918 6.9933 11.7217 0.0766 0.6805 4.6761 1.8810 2.3524 2.9574 0.2553 1.0862 0.6271 1.2048 0.3823 2.1108 8.1277 10.1043 13.2922 13.4274 78.8498 23.5300 7.7966 5.7705 47.0196 19.2948 17.8969 44.6864 24.1948 17.5736 10.1685 10.2681 11.3023 22.4809 3.1578 18.5122 2.5058 23.4261 40.3942 4.7313 30.8125
temp: 298.150 k
press: 1.00000 atm
elementType: 16 6 6 6 6 6 6 6 6 6 6 6 6 6 6 6 1 1 1 1 1 1 1 1 1 1 1 1 1 1
symmnumber: 1
zpe: 626232.3 jmol-1
zpe.correction: 0.238519 hartree
zpe.thermalcorrener: 0.252795 hartree
zpe.thermalcorrenthalpy: 0.253739 hartree
zpe.thermalcorrgfe: 0.194702 hartree
zpe.sumelectzpe: -976.918847 hartree
zpe.sumelectthermal: -976.904571 hartree
zpe.sumelectthermalent: -976.903627 hartree
zpe.sumelectthermalfe: -976.962664 hartree
dipole: -0.7484 1.7426 0.0229
dipole: 1.8967
quadrupole: -82.9020 -98.1912 -103.4274
quadrupole: -1.6869 -4.5361 2.2220
quadrupole: 11.9382 -3.3510 -8.5872 -1.6869 -4.5361 2.2220
hfenergy: -977.1573658 hartree
pointgroup: C01 [X(C15H14S1)]
dipole: 0.3095396 -0.597743 -0.3220423 debye
polarizability: 339.4576693|-4.8000739|151.8797838|36.1149244|21.7236123|118.0078824 unknown
InChI: InChI=1S/C15H14S/c1-13-7-9-15(10-8-13)16-12-11-14-5-3-2-4-6-14/h2-12H,1H3
charge 0 multiplicity 1
30 atoms
S  0.804573 1.638192 1.262231
C  4.592341 -0.718641 -0.203635
C  2.260959 0.673135 0.671276
C  3.38671 -0.767997 -0.94988
C  4.604497 0.052867 0.98768
C  2.230986 -0.073708 -0.528817
C  3.451815 0.736199 1.432121
C  -2.982155 0.298934 0.023138
C  5.824565 -1.484497 -0.652927
C  -1.771076 1.076311 0.344344
C  -4.110117 0.985451 -0.512388
C  -3.085477 -1.110225 0.216411
C  -0.564525 0.568853 0.729855
C  -5.29073 0.29394 -0.855522
C  -4.263367 -1.801193 -0.129921
C  -5.373295 -1.105208 -0.668851
H  3.352055 -1.344269 -1.882632
H  5.523807 0.113721 1.58281
H  1.321402 -0.098814 -1.138888
H  3.476947 1.309323 2.365346
H  5.858557 -1.589112 -1.751714
H  6.753666 -0.983432 -0.328856
H  5.83633 -2.50633 -0.225709
H  -1.866536 2.167439 0.249298
H  -4.051827 2.07082 -0.662472
H  -2.247689 -1.665882 0.652614
H  -0.360226 -0.504417 0.814086
H  -6.144513 0.844313 -1.266487
H  -4.323708 -2.884169 0.027532
H  -6.289166 -1.645703 -0.931941
