program: Gaussian 09
title: 000017968
version: EM64L-G09RevD.01
frameworkgroup: C1[X(C7H4ClNO)]
method: RPBEPBE
basis: SDD
operation: Freq
keyword: #p
keyword: freq=noraman
keyword: PBEPBE/SDD
title: #p freq=noraman PBEPBE/SDD
converged: NO NO NO NO
title: Mulliken charges:
elementType: Cl O N C C C C C C C H H H H
charge: -0.048049 -0.170667 0.069066 0.403512 -0.360951 -0.380833 -0.030574 -0.160746 -0.245246 -0.112929 0.277545 0.256005 0.241551 0.262316
chargesum: 0.00000
title: Mulliken charges with hydrogens summed into heavy atoms:
elementType: Cl O N C C C C C C C
charge: -0.048049 -0.170667 0.069066 0.403512 -0.083406 -0.124828 -0.030574 0.080806 0.017070 -0.112929
polarizability: 1.59475998e+02 -8.44271335e+00 9.56097721e+01 1.81542682e-02 1.82598662e-03 3.40771332e+01
1716.lowfreq: -52.4997 -12.1295 -8.9755 -7.0882 -0.0019 -0.0007 0.0015 68.1330 176.1649
frequency: -52.4962 68.0957 176.1614 222.5913 249.8059 377.2443 414.5052 429.4723 437.7557 476.5114 486.6014 562.3277 659.4611 681.6934 785.5158 786.1980 883.7266 902.0906 976.5686 980.4296 1068.8643 1082.6028 1117.0456 1175.0114 1279.1534 1362.4528 1404.7191 1437.3745 1530.4602 1565.7818 1608.1911 2399.9711 3148.7932 3170.5051 3178.3714 3183.2056
redmass: 11.6143 7.9872 5.6815 11.5447 5.4465 12.5092 7.4616 5.9915 3.0610 12.4248 12.3454 5.3834 7.2898 2.1982 8.1280 1.3845 1.4597 1.4198 1.3384 6.0390 2.1362 1.7087 3.3056 1.0801 1.2971 6.5601 2.8187 2.5921 8.1505 6.5856 7.0086 12.7422 1.0875 1.0936 1.0938 1.0988
irintensity: 0.1043 0.0194 0.0809 1.2894 0.0002 5.6216 2.0743 5.0634 4.6477 16.0334 13.8011 0.0316 4.3277 26.9536 98.2281 58.6954 26.9292 5.3019 1.3576 4.4112 22.7114 21.3038 23.0647 0.5791 2.2486 1.4910 24.3525 60.3099 0.7982 67.3079 104.7495 1568.0753 6.3963 4.1128 1.1245 4.0917
temp: 298.150 k
press: 1.00000 atm
elementType: 17 8 7 6 6 6 6 6 6 6 1 1 1 1
symmnumber: 1
zpe: 240863.7 jmol-1
zpe.correction: 0.091740 hartree
zpe.thermalcorrener: 0.099573 hartree
zpe.thermalcorrenthalpy: 0.100517 hartree
zpe.thermalcorrgfe: 0.058005 hartree
zpe.sumelectzpe: -858.487497 hartree
zpe.sumelectthermal: -858.479664 hartree
zpe.sumelectthermalent: -858.478720 hartree
zpe.sumelectthermalfe: -858.521232 hartree
dipole: -1.5705 2.4028 -0.0001
dipole: 2.8705
quadrupole: -78.3883 -56.8137 -65.7121
quadrupole: 0.9004 -0.0143 0.0098
quadrupole: -11.4169 10.1577 1.2592 0.9004 -0.0143 0.0098
hfenergy: -858.5792372 hartree
pointgroup: C01 [X(C7H4Cl1N1O1)]
dipole: 0.7010643 0.8798526 -0.099093 debye
dipolederiv: -0.5121184 0.3116039 -0.0202944 0.3996161 -0.4549041 0.0288465 -0.0286454 0.0306173 -0.0675099 -1.9313416 -0.3566334 0.0675871 -0.4167824 -0.3554501 0.016525 0.0729749 0.0152421 -0.2734484 -2.3197383 -0.4133864 0.0832448 -0.4998461 -0.4146176 0.0306971 0.0901051 0.0285393 -0.2062966 1.51368 0.2420934 -0.053359 0.2585144 0.3663805 -0.0284194 -0.0544943 -0.027929 0.132871 -0.5109967 0.0712961 0.0010214 0.2210084 -0.1333067 -0.0056585 -0.0130586 -0.0023662 -0.1401851 -0.2562661 -0.0759496 0.0086781 -0.243252 -0.0958698 -0.0033112 0.0251232 -0.0069615 -0.1852175 0.7992004 -0.468731 0.0268644 -0.6294672 0.7058106 -0.0580168 0.0421317 -0.0613118 -0.0341477 0.1595072 -0.0331368 -0.0029602 0.0665759 0.1401848 -0.026605 -0.0126137 -0.024507 -0.1180176 -0.2170847 0.1220742 -0.0100625 0.163331 -0.2944411 0.0120351 -0.0140758 0.0128811 -0.1333091 3.1496349 0.6126384 -0.1143416 0.7109583 0.4885874 -0.0288972 -0.1229816 -0.0267813 0.3386435 0.0909706 -0.0307967 0.0049681 -0.0417699 0.0052132 0.0178296 0.0060371 0.0176867 0.1792155 0.0065585 0.0849873 -0.0044442 0.0778246 0.0268455 0.0128026 -0.0037605 0.0126268 0.1760673 0.0573642 -0.0358865 0.005701 -0.0477586 -0.0812679 0.0242989 0.0068518 0.0241352 0.1579473 -0.02937 -0.0301728 0.0073971 -0.0189526 0.0968352 0.0078733 0.0064062 0.0081284 0.1733875 unknown
polarizability: 160.4209646|2.2592081|94.0489421|-2.8806251|-5.7937726|34.692997 unknown
InChI: InChI=1S/C7H4ClNO/c8-6-2-1-3-7(4-6)9-5-10/h1-4H
charge 0 multiplicity 1
14 atoms
Cl 3.11959 -1.796301 0.112303
O  -4.170327 -0.759503 0.165933
N  -1.818086 -0.168904 0.064102
C  -0.480265 0.167798 0.002088
C  0.506379 -0.853806 0.07866
C  -0.089328 1.52751 -0.137187
C  1.861145 -0.486875 0.013898
C  1.280401 1.854652 -0.198481
C  2.275635 0.852652 -0.124005
C  -2.986869 -0.463416 0.114533
H  0.2075 -1.899783 0.18602
H  -0.856868 2.30477 -0.195278
H  1.581369 2.901649 -0.305956
H  3.338124 1.105656 -0.17193
