program: Gaussian 09
title: 000253879
version: EM64L-G09RevD.01
frameworkgroup: C1[X(C8H15ClN2O2)]
method: RPBEPBE
basis: SDD
operation: Freq
keyword: #p
keyword: freq=noraman
keyword: PBEPBE/SDD
title: #p freq=noraman PBEPBE/SDD
converged: YES YES NO NO
title: Mulliken charges:
elementType: Cl O O N N C C C C C C C C H H H H H H H H H H H H H H H
charge: -0.065550 -0.253627 -0.310630 -0.354349 -0.625171 -0.509347 -0.021181 -0.164358 -0.712541 -0.716153 0.205446 0.322451 -0.672181 0.217457 0.254663 0.204259 0.284637 0.206853 0.221063 0.217065 0.209729 0.218905 0.218142 0.330931 0.326340 0.372164 0.297919 0.297064
chargesum: 0.00000
title: Mulliken charges with hydrogens summed into heavy atoms:
elementType: Cl O O N N C C C C C C C C
charge: -0.065550 -0.253627 -0.310630 -0.023418 0.073333 -0.037227 0.183078 0.120279 -0.067559 -0.069376 0.205446 0.322451 -0.077198
polarizability: 1.23067663e+02 4.47308286e+00 1.15939728e+02 -7.72954790e+00 1.13242638e+01 1.03915665e+02
1716.lowfreq: -4.9508 0.0010 0.0018 0.0024 8.4132 9.7900 21.1538 36.5394 63.7178
frequency: 18.7989 36.3619 63.7067 76.7381 86.5716 104.3055 127.7501 187.5595 222.2647 226.9398 245.4036 259.2791 291.2259 322.2223 363.7666 374.0239 404.7769 447.2573 504.3367 558.9346 570.8947 591.6131 628.7353 660.1257 687.4117 717.6998 778.5739 792.3313 840.5238 868.5337 908.8403 913.4393 942.3630 959.2067 975.5629 1015.6237 1063.5514 1101.0381 1138.3653 1143.2695 1152.7240 1197.3172 1218.5854 1255.1391 1256.8931 1278.7166 1309.6491 1319.8120 1334.9563 1347.5472 1364.5797 1379.4856 1397.7747 1418.9230 1461.3947 1466.3601 1476.2455 1486.4460 1489.6377 1509.2171 1571.5890 1614.0641 1649.0135 2962.1293 2970.3779 2973.3085 2985.4950 3006.3261 3059.0240 3063.1199 3064.3035 3069.1928 3072.9546 3073.2445 3150.4070 3361.8001 3494.4235 3610.7895
redmass: 3.0611 7.3114 5.2066 3.6591 5.3998 3.4788 3.8693 5.4483 4.0039 1.1400 4.6495 1.1344 3.4890 4.2905 2.4794 2.4021 3.7578 2.8253 3.6748 3.1080 2.0970 3.9193 1.5902 1.1985 5.5393 3.5956 1.1196 2.9881 1.8544 4.0600 1.7226 1.2272 3.4355 1.4836 2.1504 2.1778 2.1450 1.8452 2.1575 2.1355 1.1792 1.9300 1.3591 1.3552 1.3328 1.3639 1.8738 1.5442 1.6451 1.7769 1.4188 1.2148 1.2182 1.0964 1.1169 1.0469 1.0562 1.0550 1.0735 1.8956 3.6660 1.6081 5.1378 1.0807 1.0358 1.0365 1.0709 1.0809 1.0953 1.0985 1.0986 1.0568 1.0990 1.0990 1.1090 1.0586 1.0778 1.0941
irintensity: 0.1054 2.1318 2.9706 0.4828 2.9321 12.3663 1.7500 21.3559 4.0544 0.7773 8.7549 0.7484 4.0503 2.0239 0.8670 1.3076 7.0370 2.1106 25.9721 13.0616 24.4974 11.5306 52.7586 133.9828 96.0559 36.2773 121.0076 5.9027 9.6448 5.9876 10.3881 1.4698 0.8761 0.5259 2.0639 1.3695 0.6743 1.9246 5.6082 9.5268 1.9672 7.8481 1.9799 3.7662 20.6974 20.4070 46.0285 1.1240 10.3068 30.6485 2.0582 18.2424 12.4709 38.7789 22.8333 3.3124 6.7363 34.7568 20.4734 162.7489 251.8334 82.0335 310.4243 21.1010 38.4231 17.7704 18.6651 12.6271 2.3143 37.3760 29.8278 4.8931 53.1396 74.3177 0.5322 147.0519 43.4774 61.7058
temp: 298.150 k
press: 1.00000 atm
elementType: 17 8 8 7 7 6 6 6 6 6 6 6 6 1 1 1 1 1 1 1 1 1 1 1 1 1 1 1
symmnumber: 1
zpe: 604669.8 jmol-1
zpe.correction: 0.230307 hartree
zpe.thermalcorrener: 0.245438 hartree
zpe.thermalcorrenthalpy: 0.246382 hartree
zpe.thermalcorrgfe: 0.186203 hartree
zpe.sumelectzpe: -1032.862045 hartree
zpe.sumelectthermal: -1032.846913 hartree
zpe.sumelectthermalent: -1032.845969 hartree
zpe.sumelectthermalfe: -1032.906149 hartree
dipole: -1.4442 -1.3419 1.2640
dipole: 2.3418
quadrupole: -88.5939 -82.7922 -94.2596
quadrupole: -8.2983 3.6248 3.3885
quadrupole: -0.0453 5.7563 -5.7110 -8.2983 3.6248 3.3885
hfenergy: -1033.0923514 hartree
pointgroup: C01 [X(C8H15Cl1N2O2)]
dipole: 0.806005 0.3825691 0.2298376 debye
polarizability: 125.5089646|-2.2166673|111.3875498|-2.1507447|-13.8153843|106.0265415 unknown
InChI: InChI=1S/C8H15ClN2O2/c1-5(2)3-6(8(10)13)11-7(12)4-9/h5-6,11H,3-4,10H2,1-2H3
charge 0 multiplicity 1
28 atoms
Cl 2.943682 -0.125455 -2.096829
O  -2.872198 -1.556025 -0.755902
O  1.243418 -1.40966 1.375217
N  0.36877 -0.333271 -0.502009
N  -1.338396 -2.468304 0.741811
C  -1.711448 1.031229 -0.678029
C  -1.325685 2.474901 -0.246672
C  -0.994211 -0.125489 0.047331
C  -1.662201 2.750438 1.239577
C  0.142676 2.85699 -0.557684
C  -1.832055 -1.4499 -0.042943
C  1.380189 -0.908044 0.203833
C  2.772513 -0.983107 -0.417367
H  -1.564158 0.914363 -1.771321
H  -2.794923 0.88439 -0.518723
H  -1.97162 3.141303 -0.857053
H  -0.869774 0.098932 1.124663
H  -1.015944 2.165146 1.921438
H  -2.7148 2.499704 1.467804
H  -1.506993 3.817847 1.482344
H  0.399833 2.6660 -1.617185
H  0.853379 2.291897 0.072865
H  0.30933 3.932686 -0.36326
H  0.570643 0.020546 -1.44291
H  -1.821381 -3.366915 0.733597
H  -0.478017 -2.332515 1.292356
H  3.498166 -0.49845 0.25154
H  3.053601 -2.033534 -0.583485
