program: Gaussian 09
title: 000253941
version: EM64L-G09RevD.01
frameworkgroup: C1[X(C15H19FN2O6S)]
method: RPBEPBE
basis: SDD
operation: Freq
keyword: #p
keyword: freq=noraman
keyword: PBEPBE/SDD
title: #p freq=noraman PBEPBE/SDD
converged: YES YES NO NO
title: Mulliken charges:
elementType: S F O O O O O O N N C C C C C C C C C C C C C C C H H H H H H H H H H H H H H H H H H H
charge: 0.210451 -0.168353 -0.249191 -0.295852 -0.257636 -0.227795 -0.218130 -0.186319 -0.179608 -0.412975 -0.100887 -0.029270 -0.502623 -0.027627 -0.760475 0.232869 -0.146199 0.291366 0.149479 -0.494035 0.115309 -0.038005 -0.421152 -0.655695 -0.663265 0.281017 0.299772 0.257498 0.283642 0.278701 0.301943 0.275948 0.323292 0.369177 0.251467 0.250411 0.238327 0.247365 0.229928 0.223936 0.230356 0.224479 0.225212 0.243146
chargesum: 0.00000
title: Mulliken charges with hydrogens summed into heavy atoms:
elementType: S F O O O O O O N N C C C C C C C C C C C C C C C
charge: 0.210451 -0.168353 -0.249191 -0.295852 -0.257636 -0.227795 -0.218130 -0.186319 -0.179608 -0.043798 0.180130 0.270503 0.038517 0.251074 -0.182583 0.232869 0.177093 0.291366 0.149479 0.007843 0.115309 -0.038005 0.064540 0.028525 0.029572
polarizability: 2.56328367e+02 7.66161349e+00 2.02689922e+02 -6.48952008e+00 1.51179748e+01 1.87817651e+02
1716.lowfreq: -24.0388 -9.3168 -4.8220 -0.0006 0.0011 0.0019 2.9741 13.3674 15.5558
frequency: -23.3676 13.3273 15.4501 17.9458 24.9036 27.5140 41.7594 50.3100 56.7055 57.9652 88.7223 97.1179 117.8064 145.7102 167.5018 177.5581 183.1244 188.2607 205.0334 217.0055 233.3419 263.8552 286.2135 286.8642 289.2847 304.9308 347.6658 367.7503 377.1412 378.5739 442.3831 453.0385 459.1331 480.9872 495.1481 512.5548 532.0904 547.7718 613.6270 630.4897 667.2479 682.4572 686.6924 695.4905 711.3770 722.4179 744.8260 754.1415 773.6710 783.9591 789.0608 792.8989 814.2841 837.9892 869.5949 887.8493 919.4196 934.0275 945.2931 956.1909 1000.3827 1012.6457 1030.9962 1035.0582 1048.3859 1063.3904 1068.8832 1075.5863 1086.6428 1094.2969 1098.8992 1112.0705 1128.5759 1158.4071 1199.8265 1207.7684 1222.3282 1239.1784 1245.3108 1246.3908 1257.8155 1282.0449 1297.1610 1315.4654 1327.0509 1327.6650 1331.0673 1338.0308 1354.8163 1366.4421 1376.8986 1392.5091 1402.1890 1410.7191 1439.3178 1441.5268 1442.3517 1455.0873 1472.4421 1473.2368 1480.0928 1484.4045 1629.9013 1633.5707 1645.4741 1657.3876 1671.7474 2984.4667 2993.7040 2999.2040 3003.2960 3019.0792 3035.8107 3040.1139 3050.6405 3069.4940 3073.4787 3076.2517 3096.6703 3102.2656 3104.5095 3105.1768 3107.7176 3112.8209 3186.0569 3522.6997
redmass: 2.8703 7.3344 6.1133 4.3055 3.1498 3.3374 5.8242 5.6417 4.1457 4.9620 4.7048 7.6688 7.1131 4.4663 4.1371 3.0410 2.3010 1.6331 2.1702 2.9159 4.1189 4.9525 5.4940 5.8820 4.8807 5.6102 4.5143 4.1831 3.7311 11.1227 4.1745 9.2517 5.9964 5.3859 3.3710 3.3544 4.6810 3.0323 5.7153 4.7060 5.0231 3.9951 2.1870 6.3818 9.4153 5.5214 7.1774 4.1992 2.1630 1.3151 3.3401 1.3704 3.9201 4.4892 3.7849 1.3769 3.2384 3.3717 3.1824 2.6156 3.3540 2.0110 2.5997 2.1071 2.1498 1.9023 2.8500 4.3483 1.6316 1.9230 2.2704 2.7813 5.4333 1.5780 2.8923 1.4463 1.6335 1.1893 1.1737 1.1690 2.0575 1.5532 1.3306 1.3467 1.7214 1.7765 1.3820 1.4620 1.4845 1.6992 2.2357 1.1927 1.2077 1.1105 1.8322 1.0853 1.0892 1.1116 1.0388 1.0417 1.0511 1.0509 5.8104 8.6771 12.5362 9.7626 6.4399 1.0630 1.0611 1.0356 1.0365 1.0583 1.0654 1.0982 1.0970 1.0862 1.0866 1.0900 1.1008 1.1005 1.1041 1.1005 1.1006 1.1009 1.0939 1.0770
irintensity: 0.0246 0.8353 0.8139 0.1445 0.5458 0.5543 1.1819 2.1518 1.4119 1.1323 4.1233 1.4205 0.9293 3.6660 0.7330 3.7761 3.5956 3.0871 4.3346 1.3133 0.6266 13.1479 5.7090 19.7275 9.9540 2.5389 1.0931 5.6565 2.1500 13.9059 11.8351 6.2253 7.2015 1.9414 1.6568 18.8430 25.8959 1.4101 2.2910 1.1937 17.9608 29.6432 13.3899 22.7890 1.2805 2.3105 4.7651 7.0550 122.1688 9.7842 4.7687 14.4010 7.7508 35.6496 21.2163 53.0785 125.3795 25.1739 67.9073 53.6791 59.2365 54.0070 134.4342 126.6549 19.7659 7.6687 161.2783 69.5459 2.4692 74.6958 66.4325 162.8962 80.3732 66.4373 18.9836 2.6860 23.0161 0.3861 0.7943 14.0598 205.8212 42.3913 29.4430 5.3459 17.5846 41.4496 24.2215 22.8434 4.1159 32.7575 6.3835 19.1895 18.4623 19.4351 51.8584 32.3344 23.1989 16.8969 13.1163 16.0593 13.4541 15.6851 277.2382 151.2018 247.3879 156.4358 494.4617 11.8247 18.2160 31.9575 21.0520 14.1497 3.9362 3.0444 4.9142 1.8824 8.3081 10.3361 27.8634 22.2615 1.7884 28.1691 22.2902 9.2386 39.4409 70.6659
temp: 298.150 k
press: 1.00000 atm
elementType: 16 9 8 8 8 8 8 8 7 7 6 6 6 6 6 6 6 6 6 6 6 6 6 6 6 1 1 1 1 1 1 1 1 1 1 1 1 1 1 1 1 1 1 1
symmnumber: 1
zpe: 872857.3 jmol-1
zpe.correction: 0.332454 hartree
zpe.thermalcorrener: 0.357988 hartree
zpe.thermalcorrenthalpy: 0.358932 hartree
zpe.thermalcorrgfe: 0.270935 hartree
zpe.sumelectzpe: -1639.880442 hartree
zpe.sumelectthermal: -1639.854908 hartree
zpe.sumelectthermalent: -1639.853964 hartree
zpe.sumelectthermalfe: -1639.941961 hartree
dipole: 5.1780 1.8556 -1.0920
dipole: 5.6078
quadrupole: -162.9849 -161.2531 -159.2880
quadrupole: -14.8055 15.1140 4.0145
quadrupole: -1.8096 -0.0778 1.8874 -14.8055 15.1140 4.0145
hfenergy: -1640.212896 hartree
pointgroup: C01 [X(C15H19F1N2O6S1)]
dipole: -2.1474405 -0.0355088 -0.5048853 debye
polarizability: 253.4796176|-12.3659509|193.062015|6.2197759|-18.6516555|200.2943074 unknown
InChI: InChI=1S/C15H19FN2O6S/c1-3-12(19)24-9-5-11(23-10(9)7-25-13(20)4-2)18-6-8(16)14(21)17-15(18)22/h6,9-11,17H,3-5,7H2,1-2H3
charge 0 multiplicity 1
44 atoms
S  -3.015964 2.448178 -1.462263
F  2.847017 -0.698634 2.964871
O  -0.277085 0.943478 -0.636703
O  -0.775481 -1.86629 0.466521
O  3.338961 0.946065 -2.276629
O  -0.949384 -4.015724 -0.423625
O  5.388151 0.110132 1.85593
O  -4.836895 0.996104 -0.00493
N  1.98472 0.163915 -0.506819
N  4.301864 0.52048 -0.183503
C  -1.097353 -1.303531 -0.878386
C  -1.538441 0.153814 -0.638715
C  0.174725 -1.168489 -1.742712
C  0.772935 0.217277 -1.368648
C  -2.511253 0.651618 -1.719013
C  3.218624 0.576382 -1.077354
C  1.886454 -0.234488 0.825113
C  -0.732358 -3.278503 0.560124
C  2.983576 -0.279395 1.639717
C  -0.401229 -3.698987 1.97977
C  4.322718 0.110418 1.187023
C  -4.468146 2.147701 -0.324796
C  -5.100381 3.440633 0.170642
C  -0.334877 -5.227043 2.150073
C  -6.632271 3.325812 0.333837
H  -1.866236 -1.940783 -1.345462
H  -1.986534 0.272962 0.361145
H  -0.103188 -1.176169 -2.811007
H  0.880073 -1.997172 -1.579716
H  1.085228 0.792264 -2.25537
H  -3.446408 0.065218 -1.672977
H  -2.077533 0.603191 -2.731431
H  0.890019 -0.505992 1.180602
H  5.203801 0.813676 -0.573803
H  0.558014 -3.22273 2.263378
H  -1.161119 -3.253308 2.650353
H  -4.825672 4.273601 -0.501531
H  -4.636074 3.663612 1.153468
H  0.436373 -5.667508 1.495628
H  -0.090908 -5.481296 3.195916
H  -1.29814 -5.698237 1.891055
H  -7.036363 4.248202 0.785696
H  -7.12641 3.173759 -0.641579
H  -6.89155 2.473184 0.983312
