program: Gaussian 09
title: 000253912
version: EM64L-G09RevD.01
frameworkgroup: C1[X(C17H26N2O2)]
method: RPBEPBE
basis: SDD
operation: Freq
keyword: #p
keyword: freq=noraman
keyword: PBEPBE/SDD
title: #p freq=noraman PBEPBE/SDD
converged: YES YES NO NO
title: Mulliken charges:
elementType: O O N N C C C C C C C C C C C C C C C C C H H H H H H H H H H H H H H H H H H H H H H H H H H
charge: -0.180049 -0.207291 -0.195986 -0.449444 -0.362296 -0.349074 -0.349327 -0.354315 -0.493321 -0.341309 -0.338854 0.189913 -0.692796 -0.691458 0.189278 0.233746 -0.326611 -0.336881 -0.248567 -0.224715 -0.227031 0.199409 0.227364 0.196263 0.207324 0.206351 0.187623 0.194485 0.194380 0.248084 0.249635 0.193124 0.200497 0.196059 0.192967 0.207592 0.220537 0.215837 0.213861 0.219518 0.211451 0.381063 0.216409 0.278208 0.230250 0.234542 0.233555
chargesum: 0.00000
title: Mulliken charges with hydrogens summed into heavy atoms:
elementType: O O N N C C C C C C C C C C C C C C C C C
charge: -0.180049 -0.207291 -0.195986 -0.068381 0.064477 0.054513 0.044647 0.034549 0.004399 0.052312 0.050171 0.189913 -0.048829 -0.046628 0.189278 0.233746 -0.110202 -0.058673 -0.018317 0.009827 0.006523
polarizability: 2.36963796e+02 -2.83213116e+00 1.61965668e+02 1.43490678e+01 -1.60654954e+01 2.19069436e+02
1716.lowfreq: -7.0316 -2.6049 0.0004 0.0005 0.0006 6.6996 18.0211 21.2586 26.6470
frequency: 17.8661 21.1662 26.6109 36.4498 39.1161 54.2224 59.2207 59.9375 75.3591 99.2018 113.2780 125.5977 153.0415 158.3882 169.3261 200.7224 226.1467 234.1885 239.1656 260.4062 277.8346 286.0143 317.9471 333.9793 400.6403 408.9679 431.5550 433.2694 469.5701 484.9041 531.5212 540.1751 582.4541 614.1632 676.7794 690.0125 704.9513 732.5555 734.0395 789.3368 793.1693 801.0851 836.7992 843.9029 853.2512 898.8467 899.8927 901.9133 927.4275 930.0025 936.5496 943.6429 960.4189 988.5285 989.3011 1011.1822 1022.0306 1023.9518 1025.7329 1062.0285 1072.6476 1079.5709 1081.9350 1089.7041 1095.3684 1113.2917 1120.2049 1155.6427 1163.7765 1173.7721 1186.4635 1198.0170 1222.9018 1232.7370 1242.1193 1251.1649 1267.4397 1276.9838 1281.9837 1286.4572 1291.0368 1299.3209 1322.3719 1326.8623 1344.3178 1346.3290 1369.5055 1373.7361 1386.1129 1392.1935 1392.4317 1433.0618 1448.2429 1451.4867 1466.2133 1467.4720 1470.1728 1472.0822 1477.0987 1478.0323 1479.5975 1481.1763 1484.5609 1488.9778 1490.0842 1578.0941 1608.5989 1612.8983 1670.7612 2892.0244 2898.0549 2960.9290 2964.0682 2966.4346 2972.6521 2974.7341 2975.8554 2975.9967 3003.5734 3005.7303 3018.0810 3026.8146 3041.1040 3045.0681 3050.1638 3071.7915 3072.2027 3075.9736 3076.2819 3120.2045 3132.7446 3145.0575 3157.5833 3169.4065 3222.8960
redmass: 4.3981 4.1550 4.4221 4.4121 3.4385 1.5926 4.9856 1.7970 3.4778 2.9085 2.8007 3.6114 3.0401 3.8916 2.4296 4.1981 1.1215 1.1984 7.6021 3.3683 3.5183 2.4548 3.0129 5.4716 2.7952 3.4433 3.4882 3.9325 4.6268 2.8723 3.9889 4.9357 3.8418 6.4307 5.8671 3.9301 1.5427 1.0804 1.0752 1.2308 1.1830 2.6026 4.2227 5.3772 1.2622 2.1948 1.8017 1.8285 1.3346 1.3100 1.6002 1.4075 1.9265 1.3806 5.7793 1.3453 3.1728 2.9281 2.7243 2.4405 2.3907 2.3016 2.1951 2.1569 2.2567 2.2758 2.3237 2.2130 1.8865 1.0649 2.1439 1.1874 1.3075 1.3919 1.4504 3.3722 1.3331 1.2963 1.0975 1.1322 1.1393 1.2272 1.3437 1.3457 1.4975 1.4851 1.4035 1.4416 8.7818 1.2145 1.2187 2.2216 1.0903 1.8251 1.1269 1.0753 1.0900 1.0805 1.0424 1.0568 1.0921 1.0932 1.8399 1.1013 1.1129 6.1722 5.6550 5.9366 9.5305 1.0703 1.0696 1.0649 1.0588 1.0584 1.0593 1.0466 1.0375 1.0487 1.0984 1.0962 1.0946 1.0971 1.1008 1.0977 1.0960 1.1008 1.1007 1.0994 1.0995 1.0868 1.0874 1.0921 1.0955 1.1008 1.0767
irintensity: 0.3654 0.5101 1.0360 3.5034 0.0391 0.2047 0.7787 0.3087 0.7517 1.0715 0.3960 0.7606 0.9080 2.6068 1.2397 1.0775 0.0049 0.0955 0.0445 2.3701 6.7906 0.7788 1.3392 2.3706 0.0218 0.3534 0.3383 2.4521 2.7395 10.5931 35.6331 15.8695 0.9265 0.4650 2.1742 0.1376 104.9933 8.2712 8.2619 0.1109 0.1654 11.3105 37.4193 3.2788 4.5433 5.3196 6.2796 11.2468 11.4861 0.3271 14.0065 18.4691 45.9228 0.6658 1.3111 1.4575 2.5936 4.2214 5.7725 22.7726 1.5135 9.5814 18.1175 5.8856 33.7756 0.7646 9.9197 40.3259 14.9162 1.8855 11.8086 29.1953 1.5944 7.4139 28.0923 159.3991 5.8566 6.9388 4.1455 0.3906 1.7842 12.9069 15.1775 1.4616 2.6391 3.1796 15.7634 35.0928 1.2236 9.1628 22.7172 43.8762 1.5640 739.1248 64.4356 1.5345 17.6348 12.6887 13.7956 7.8335 8.7106 6.4118 108.7741 37.5270 57.7153 24.1328 24.7722 2.1662 323.6990 23.4477 129.6173 39.9267 4.7145 8.9555 71.7316 32.7051 23.9551 76.8523 1.7923 2.3798 2.0341 12.5989 42.8685 23.1148 47.0758 84.1066 74.2556 51.5464 54.6118 8.5897 2.8136 23.1550 12.7276 23.7465 298.0711
temp: 298.150 k
press: 1.00000 atm
elementType: 8 8 7 7 6 6 6 6 6 6 6 6 6 6 6 6 6 6 6 6 6 1 1 1 1 1 1 1 1 1 1 1 1 1 1 1 1 1 1 1 1 1 1 1 1 1 1
symmnumber: 1
zpe: 1052535.4 jmol-1
zpe.correction: 0.400890 hartree
zpe.thermalcorrener: 0.424172 hartree
zpe.thermalcorrenthalpy: 0.425117 hartree
zpe.thermalcorrgfe: 0.343993 hartree
zpe.sumelectzpe: -921.748099 hartree
zpe.sumelectthermal: -921.724816 hartree
zpe.sumelectthermalent: -921.723872 hartree
zpe.sumelectthermalfe: -921.804996 hartree
dipole: 3.8563 3.4655 -6.2271
dipole: 8.1030
quadrupole: -115.8652 -131.5846 -143.7172
quadrupole: -5.4119 13.1902 11.2234
quadrupole: 14.5238 -1.1956 -13.3282 -5.4119 13.1902 11.2234
hfenergy: -922.1489885 hartree
pointgroup: C01 [X(C17H26N2O2)]
dipole: 1.9457101 1.9254647 -1.6339636 debye
polarizability: 232.0608175|-14.7467464|185.9158397|8.6221844|-33.9906783|200.022242 unknown
InChI: InChI=1S/C17H26N2O2/c1-3-5-12-19(13-6-4-2)14-16(20)18-17(21)15-10-8-7-9-11-15/h7-11,18H,3-6,12-14H2,1-2H3
charge 0 multiplicity 1
47 atoms
O  -0.157029 -2.982235 3.065941
O  -2.647409 -1.9815 1.760715
N  2.119948 -0.653339 1.331772
N  -0.416407 -1.40568 1.293879
C  2.095104 0.56227 2.20765
C  3.356658 -0.75868 0.500518
C  1.805796 1.867088 1.438019
C  3.155141 -1.579086 -0.790284
C  1.823188 -1.890413 2.101432
C  1.788325 3.102396 2.368487
C  4.462852 -1.727132 -1.601538
C  0.300523 -2.161469 2.236265
C  1.488502 4.411926 1.607903
C  4.265702 -2.522702 -2.909855
C  -1.806799 -1.355777 1.060785
C  -2.230023 -0.471271 -0.090912
C  -1.333946 0.084609 -1.04356
C  -3.618849 -0.203863 -0.211876
C  -1.822195 0.896993 -2.090386
C  -4.104538 0.610454 -1.254197
C  -3.206449 1.165852 -2.196717
H  3.052786 0.660226 2.773487
H  1.296861 0.413566 2.960154
H  4.196788 -1.193351 1.094174
H  3.664853 0.265579 0.222939
H  0.827023 1.773446 0.926293
H  2.563546 2.025375 0.644412
H  2.381513 -1.084028 -1.411192
H  2.764653 -2.588583 -0.549107
H  2.251434 -1.885507 3.125973
H  2.253189 -2.765056 1.579412
H  2.76648 3.188523 2.884369
H  1.028783 2.952555 3.162226
H  5.227353 -2.230194 -0.974919
H  4.866055 -0.720693 -1.83634
H  2.252493 4.604003 0.830979
H  1.476128 5.280468 2.29109
H  0.503914 4.36224 1.10645
H  3.892413 -3.542879 -2.701715
H  5.213574 -2.618321 -3.47002
H  3.531083 -2.025935 -3.571042
H  0.250168 -0.802869 0.767068
H  -0.258035 -0.1236 -1.002655
H  -4.292202 -0.653354 0.525449
H  -1.125195 1.314885 -2.825115
H  -5.178201 0.811738 -1.334774
H  -3.581847 1.797328 -3.009637
