program: Gaussian 09
title: 000253860
version: EM64L-G09RevD.01
frameworkgroup: C1[X(C12H18N4O2S)]
method: RPBEPBE
basis: SDD
operation: Freq
keyword: #p
keyword: freq=noraman
keyword: PBEPBE/SDD
title: #p freq=noraman PBEPBE/SDD
converged: NO NO NO NO
title: Mulliken charges:
elementType: S O O N N N N C C C C C C C C C C C C H H H H H H H H H H H H H H H H H H
charge: 0.248301 -0.268688 -0.269501 -0.164627 -0.371569 -0.219667 -0.039967 -0.346996 -0.340848 0.106111 0.106359 -0.649782 -0.352138 -0.167361 0.134452 0.213140 -0.615100 -0.690217 -0.598625 0.211893 0.211892 0.192329 0.192300 0.284918 0.284836 0.197133 0.197137 0.342011 0.273939 0.244474 0.244468 0.210815 0.210808 0.219694 0.268387 0.249840 0.249850
chargesum: 0.00000
title: Mulliken charges with hydrogens summed into heavy atoms:
elementType: S O O N N N N C C C C C C C C C C C C
charge: 0.248301 -0.268688 -0.269501 -0.164627 -0.029559 -0.219667 -0.039967 0.076789 0.043780 0.106111 0.106359 -0.080027 0.042131 -0.167361 0.134452 0.213140 0.147780 -0.048900 0.169452
polarizability: 2.92696809e+02 -1.94054425e+00 1.88618129e+02 3.82947660e-02 2.06194468e-02 1.01808066e+02
1716.lowfreq: -1.8304 -0.0011 0.0009 0.0011 5.8127 8.9455 15.7165 31.2011 34.8843
frequency: 15.3726 31.1941 34.8774 58.6538 73.3643 96.8224 100.1816 113.3411 114.3481 118.6593 122.1371 134.6446 160.9512 183.5209 215.7895 217.2336 234.2446 291.1370 305.9552 329.7646 339.3791 358.7548 374.3114 382.2473 411.0426 438.1878 480.0950 490.0125 586.3179 629.1547 637.0492 668.1175 680.0775 695.8422 703.6093 731.2443 738.7488 753.9113 766.1254 829.4260 896.3275 925.8091 936.1498 951.9012 968.3631 1008.9341 1037.5604 1052.4498 1072.2053 1072.3203 1101.7327 1112.7996 1129.0968 1131.8848 1168.7727 1193.6409 1195.1056 1227.2405 1235.3611 1250.0253 1260.7988 1281.6600 1288.0648 1290.2191 1292.7256 1323.9276 1337.3169 1355.0778 1370.7270 1392.6296 1393.8975 1419.4409 1430.6406 1445.0571 1466.4457 1470.2431 1474.1305 1474.2495 1478.4252 1478.6636 1480.0807 1480.4223 1488.2267 1510.2848 1577.9988 1615.8943 1659.2262 2961.9910 2971.2677 2973.8712 2983.7084 3002.7094 3005.5051 3011.4202 3024.9410 3043.7108 3048.0513 3071.2976 3074.7398 3094.4803 3103.0048 3122.9841 3137.2160 3137.2971 3588.0263
redmass: 5.0749 1.7953 4.8179 2.8860 4.7550 1.4836 1.3173 4.0157 2.8044 2.4658 1.6046 2.1531 5.5040 4.6942 8.8235 4.3764 1.1073 3.2134 6.2147 4.0784 4.3157 7.3429 5.3401 7.1128 5.6700 3.7734 7.5370 9.8778 6.6900 10.8334 1.3397 8.5275 4.5102 6.7987 11.1879 1.0680 11.2140 1.1120 4.9170 1.1940 1.8351 4.8114 5.8110 1.1992 3.8060 4.0892 3.3232 2.9361 1.1416 2.4644 3.9909 2.3445 1.3031 1.2976 1.8890 3.3092 1.6057 2.6907 1.2286 1.2722 6.1038 1.3540 5.6813 1.1327 1.0521 7.2239 1.4938 1.5733 5.1028 1.2185 2.9349 1.3334 1.2726 1.0891 1.0672 1.0744 1.2135 1.0441 1.0692 1.0420 1.0708 1.0427 1.0890 3.1300 8.2415 10.4682 10.4748 1.0586 1.0596 1.0364 1.0591 1.0993 1.0336 1.0328 1.1030 1.0570 1.1047 1.1011 1.0993 1.1025 1.1021 1.1091 1.1012 1.1022 1.0821
irintensity: 0.0055 0.6440 0.1308 0.5081 0.3446 0.0167 0.3160 0.0572 1.8196 1.0062 1.6164 0.2081 3.9230 17.6969 1.8600 1.7633 0.0001 2.9089 0.1077 9.9262 9.0437 0.8361 8.0487 17.3087 6.0309 14.8082 19.3914 6.4570 3.5630 1.3270 92.6103 10.4978 22.5041 19.4529 4.7195 12.5512 14.1940 1.0493 0.5414 3.1780 1.3438 4.2267 10.3726 0.1142 42.1278 1.9273 39.0524 11.8138 1.0743 0.4496 37.6211 13.5947 0.2731 0.1749 20.3718 68.3889 0.0131 3.3987 1.3509 0.0727 28.1222 17.5138 40.9216 0.5998 0.2393 85.1377 23.8698 1.0319 3.2767 15.4907 414.9978 172.4164 79.8924 13.5212 1.7043 1.2364 2.1042 18.1102 6.6244 13.0850 2.5879 17.5307 21.8604 146.7602 17.1790 519.8926 563.7188 1.4223 34.4311 38.3353 51.6801 0.0354 34.3046 31.3349 5.2595 8.9982 39.8007 90.2597 52.0978 19.0412 17.9677 16.3646 0.4986 0.7351 91.5836
temp: 298.150 k
press: 1.00000 atm
elementType: 16 8 8 7 7 7 7 6 6 6 6 6 6 6 6 6 6 6 6 1 1 1 1 1 1 1 1 1 1 1 1 1 1 1 1 1 1
symmnumber: 1
zpe: 778806.2 jmol-1
zpe.correction: 0.296632 hartree
zpe.thermalcorrener: 0.317275 hartree
zpe.thermalcorrenthalpy: 0.318219 hartree
zpe.thermalcorrgfe: 0.244557 hartree
zpe.sumelectzpe: -1234.193015 hartree
zpe.sumelectthermal: -1234.172372 hartree
zpe.sumelectthermalent: -1234.171428 hartree
zpe.sumelectthermalfe: -1234.245089 hartree
dipole: 5.4672 0.1850 0.0013
dipole: 5.4703
quadrupole: -124.9889 -127.0381 -120.4837
quadrupole: 1.8728 -0.0003 -0.0026
quadrupole: -0.8187 -2.8678 3.6865 1.8728 -0.0003 -0.0026
hfenergy: -1234.4896465 hartree
pointgroup: C01 [X(C12H18N4O2S1)]
dipole: 2.1512336 0.0637833 -0.00088 debye
polarizability: 292.6786971|-2.3758376|188.6356026|-0.1055504|0.2282253|101.8087046 unknown
InChI: InChI=1S/C12H18N4O2S/c1-4-5-6-7-19-11-13-8-9(14-11)15(2)12(18)16(3)10(8)17/h13H,4-7H2,1-3H3
charge 0 multiplicity 1
37 atoms
S  2.048515 -1.944492 -0.006124
O  -3.831158 -2.344694 -0.004977
O  -4.104323 2.374095 0.007452
N  -1.958598 1.419464 0.004204
N  -0.747661 -1.921011 -0.004845
N  -3.943392 0.03513 0.001252
N  0.179074 0.162339 0.00019
C  4.59912 -0.761171 -0.006262
C  5.505104 0.494537 -0.003098
C  -1.814782 -1.008007 -0.002143
C  -1.209035 0.25483 0.000917
C  3.11347 -0.368031 -0.002192
C  7.0116 0.144342 -0.007977
C  0.423195 -1.178105 -0.00338
C  -3.232828 -1.223741 -0.002221
C  -3.376058 1.339972 0.004462
C  -1.303467 2.740586 0.007524
C  7.91328 1.39785 -0.004912
C  -5.42371 -0.01347 0.001562
H  4.829593 -1.382189 0.881916
H  4.826293 -1.375346 -0.900025
H  5.27696 1.113659 0.888963
H  5.272934 1.121002 -0.888968
H  2.829388 0.211142 -0.894827
H  2.832541 0.204715 0.895584
H  7.243435 -0.482543 0.876839
H  7.239331 -0.475231 -0.898986
H  -0.84614 -2.936122 -0.007372
H  -2.096401 3.502499 0.008738
H  -0.669601 2.85229 -0.888169
H  -0.670713 2.84845 0.90449
H  7.721621 2.026054 -0.895293
H  7.725445 2.018907 0.891286
H  8.984147 1.123984 -0.008293
H  -5.715334 -1.074047 -0.000939
H  -5.820186 0.499189 -0.890042
H  -5.819655 0.494868 0.895867
