program: Gaussian 09
title: 000253841
version: EM64L-G09RevD.01
frameworkgroup: C1[X(C10H14N6OS)]
method: RPBEPBE
basis: SDD
operation: Freq
keyword: #p
keyword: freq=noraman
keyword: PBEPBE/SDD
title: #p freq=noraman PBEPBE/SDD
converged: YES YES NO NO
title: Mulliken charges:
elementType: S O N N N N N N C C C C C C C C C C H H H H H H H H H H H H H H
charge: 0.290646 -0.336381 -0.164652 -0.418243 -0.047897 -0.106878 0.005632 -0.405181 -0.333204 -0.375629 0.196929 0.110701 -0.220135 -0.356285 0.305592 -0.372114 -0.822493 -0.605162 0.207492 0.253703 0.269053 0.220399 0.274219 0.363559 0.247465 0.293922 0.245444 0.283034 0.282750 0.217453 0.218175 0.278088
chargesum: 0.00000
title: Mulliken charges with hydrogens summed into heavy atoms:
elementType: S O N N N N N N C C C C C C C C C C
charge: 0.290646 -0.336381 -0.164652 -0.054684 -0.047897 -0.106878 0.005632 -0.111259 0.127991 0.113823 0.196929 0.110701 0.054084 -0.356285 0.305592 -0.124650 -0.011266 0.108554
polarizability: 2.54171787e+02 1.38831429e+01 1.93558141e+02 -6.80296877e+00 1.64075300e-01 8.76224251e+01
1716.lowfreq: -2.0521 -0.0012 -0.0009 0.0010 3.0503 8.1944 19.4903 42.3475 54.1892
frequency: 19.4700 42.3047 54.1876 55.7786 79.8027 99.6023 111.3784 121.6494 128.4405 143.3213 156.7506 198.1760 217.4122 238.3830 254.1150 272.7772 310.6641 349.0618 408.9219 447.4392 462.4272 488.5574 509.2260 539.0654 564.2620 626.2235 637.0255 651.4893 660.0818 662.3782 696.7529 712.8807 783.6515 796.2226 825.8397 837.4246 865.7814 895.0411 914.4195 919.1570 978.7462 985.4319 993.7078 1054.4928 1077.6462 1107.3037 1127.2200 1128.0565 1133.0311 1160.1105 1196.3965 1204.5768 1237.3262 1265.0009 1267.7017 1295.5831 1301.7146 1325.3598 1345.2163 1349.0839 1359.6735 1375.1829 1397.1948 1419.4653 1430.4513 1434.6155 1448.3599 1458.5682 1462.1387 1469.2153 1488.0400 1509.0296 1517.9797 1542.7526 1545.5009 1634.2860 2965.7722 2976.5077 3010.1298 3027.9587 3038.6493 3055.6694 3075.6195 3103.8902 3153.5175 3160.3378 3167.9806 3228.6115 3292.4039 3563.0616
redmass: 5.8068 4.2196 4.8390 4.0597 3.7306 2.4683 1.2123 1.6960 2.5897 4.4473 3.6306 5.1698 4.2658 3.7080 4.8206 4.7757 5.2978 2.9367 10.6678 1.3266 2.3725 2.9385 4.9851 4.5894 6.7086 7.5414 4.8045 4.7790 4.9329 6.2370 5.1870 10.8710 1.9588 1.9162 10.0718 1.5799 2.5212 5.6504 3.2433 1.4395 1.1823 2.2507 1.4127 2.6411 3.7373 5.8748 1.3177 3.6050 1.6757 2.6486 2.7721 2.7147 1.3396 1.6749 2.2202 8.7571 3.2095 1.5649 1.1818 1.8545 1.3024 3.5789 1.6126 1.1798 2.3160 1.0522 1.0558 1.0992 1.3249 1.4821 1.0458 1.6956 2.9590 3.3511 3.1158 3.9218 1.0359 1.0652 1.0596 1.0282 1.1026 1.0968 1.1049 1.0966 1.1043 1.1056 1.0921 1.0985 1.0836 1.0772
irintensity: 1.3830 2.3334 2.1950 4.5642 11.2722 4.3926 0.2863 1.3810 5.5372 0.7059 3.6372 2.5389 2.9651 0.4371 0.7055 3.6498 10.1971 25.3552 2.5324 67.8497 13.7869 2.8711 2.4363 1.3018 12.5435 1.2147 11.9894 1.4944 1.1506 7.4693 16.7062 28.1866 59.7985 114.8268 55.7542 11.2813 1.9999 54.0967 31.6328 10.2108 6.2766 24.6421 2.1307 0.1178 34.6349 30.8925 1.1484 30.2442 41.7945 109.6159 2.4710 74.8666 11.8353 11.2480 193.2946 110.7293 98.9444 10.7944 4.8913 37.8872 2.8825 11.6873 42.8640 32.4251 30.5085 14.7175 29.8729 34.5508 97.4880 24.5637 14.2606 317.1332 225.6178 315.3977 200.8733 131.2788 123.3334 41.5981 28.0384 20.6599 50.0652 6.8121 19.0066 1.9325 7.6554 9.2005 10.4396 0.0140 694.4357 8.8735
temp: 298.150 k
press: 1.00000 atm
elementType: 16 8 7 7 7 7 7 7 6 6 6 6 6 6 6 6 6 6 1 1 1 1 1 1 1 1 1 1 1 1 1 1
symmnumber: 1
zpe: 649595.1 jmol-1
zpe.correction: 0.247418 hartree
zpe.thermalcorrener: 0.265412 hartree
zpe.thermalcorrenthalpy: 0.266356 hartree
zpe.thermalcorrgfe: 0.199112 hartree
zpe.sumelectzpe: -1189.941122 hartree
zpe.sumelectthermal: -1189.923128 hartree
zpe.sumelectthermalent: -1189.922184 hartree
zpe.sumelectthermalfe: -1189.989428 hartree
dipole: -1.7071 -1.9295 -0.7035
dipole: 2.6705
quadrupole: -135.5808 -97.4184 -114.7876
quadrupole: 1.5368 -4.5848 -0.3161
quadrupole: -19.6519 18.5106 1.1414 1.5368 -4.5848 -0.3161
hfenergy: -1190.18854 hartree
pointgroup: C01 [X(C10H14N6O1S1)]
dipole: 0.7108372 -0.7498003 0.1908534 debye
polarizability: 254.9902238|-10.03251|191.471975|-11.0431973|9.8904131|88.8901539 unknown
InChI: InChI=1S/C10H14N6OS/c1-11-10(17)12-3-4-16-6-15-7-8(16)13-5-14-9(7)18-2/h5-6,11-12H,3-4H2,1-2H3
charge 0 multiplicity 1
32 atoms
S  4.895607 -0.037999 -0.297477
O  -4.767086 0.296224 -0.278852
N  0.178291 1.688617 0.231418
N  -2.456839 -0.045514 -0.51873
N  2.43832 2.156102 0.170778
N  0.29656 -0.778103 -0.151924
N  2.602448 -1.564687 -0.39053
N  -3.876938 -1.867244 -0.118222
C  -1.270966 1.961498 0.415233
C  -2.181338 1.376664 -0.692021
C  0.828481 0.470158 0.014239
C  2.22874 0.781323 -0.019128
C  1.198427 2.653416 0.316181
C  3.113739 -0.308752 -0.232683
C  -3.762641 -0.488519 -0.304311
C  1.246985 -1.737341 -0.346113
C  5.483942 -1.801361 -0.597074
C  -5.175146 -2.502258 0.113868
H  -1.372848 3.061468 0.432689
H  -1.596585 1.567238 1.395159
H  -3.159611 1.889348 -0.648017
H  -1.730528 1.586963 -1.682902
H  0.970368 3.704327 0.485614
H  -1.631448 -0.66426 -0.434489
H  0.888973 -2.761383 -0.483839
H  -3.041607 -2.450259 -0.171156
H  6.581083 -1.732179 -0.655185
H  5.060496 -2.179322 -1.537434
H  5.171107 -2.444195 0.236819
H  -5.206512 -3.026021 1.088536
H  -5.427806 -3.22307 -0.687517
H  -5.932662 -1.701876 0.118472
