program: Gaussian 09
title: 000253819
version: EM64L-G09RevD.01
frameworkgroup: C1[X(C7H11NO4)]
method: RPBEPBE
basis: SDD
operation: Freq
keyword: #p
keyword: freq=noraman
keyword: PBEPBE/SDD
title: #p freq=noraman PBEPBE/SDD
converged: YES YES NO NO
title: Mulliken charges:
elementType: O O O O N C C C C C C C H H H H H H H H H H H
charge: -0.253016 -0.284406 -0.264223 -0.338973 -0.661748 -0.591524 0.412868 -0.486250 0.274899 0.263209 -0.503761 -0.504857 0.266076 0.267245 0.245553 0.375876 0.350432 0.239799 0.245801 0.248668 0.236416 0.235421 0.226494
chargesum: 0.00000
title: Mulliken charges with hydrogens summed into heavy atoms:
elementType: O O O O N C C C C C C C
charge: -0.253016 -0.284406 -0.264223 -0.338973 0.064560 -0.058203 0.412868 -0.240697 0.274899 0.263209 0.230508 0.193474
polarizability: 1.54371666e+02 7.33717255e+00 9.29652713e+01 2.73210946e+00 -3.01969025e+00 6.28409982e+01
1716.lowfreq: -1.4656 -0.0010 -0.0006 0.0002 8.6393 12.8708 26.1223 51.2185 88.6202
frequency: 26.0466 51.1777 88.6143 95.5893 105.0233 111.5708 143.7308 173.8500 196.7028 229.8714 266.2473 289.0355 335.1810 357.9737 395.7634 501.4848 567.5601 585.5276 660.6595 684.9216 708.7873 719.9640 780.0540 823.1336 846.2086 867.5337 920.9266 942.2379 973.1138 1005.4172 1111.3688 1114.1415 1117.5159 1135.3297 1146.7374 1148.5863 1151.5466 1215.0116 1296.5034 1347.6237 1413.0522 1423.6458 1433.1309 1446.2508 1449.9048 1453.6582 1462.2821 1465.8577 1548.6114 1588.1015 1634.5297 1639.2807 2983.7528 2996.3303 3010.2635 3093.7277 3114.9100 3116.3622 3138.1846 3157.6101 3197.2950 3347.6377 3558.5468
redmass: 3.8162 6.0637 2.1496 1.1787 1.3792 3.5147 4.9896 3.8607 4.2488 4.2966 4.0356 3.6248 4.9387 4.2837 6.2146 2.5546 4.7904 4.1752 1.4365 5.0997 1.8012 4.7193 1.6072 1.1911 5.4298 6.0152 4.5829 3.0293 4.1319 4.6811 1.2646 1.2677 2.1768 1.4138 1.7334 1.6150 1.6333 1.4458 1.9002 2.3290 1.5904 1.2026 1.1546 1.4865 1.0518 1.0498 1.0508 1.0550 3.2944 2.8914 7.7720 2.4610 1.0682 1.0298 1.0294 1.1040 1.1049 1.0918 1.1041 1.1052 1.0923 1.0532 1.0994
irintensity: 1.1425 0.4070 2.7216 0.7523 2.1056 2.7608 1.1322 2.9923 8.2517 0.6298 14.4913 9.2861 56.0651 0.5009 2.9199 1.0085 1.6981 4.4817 79.5687 12.3796 91.7282 8.4283 65.4754 94.1673 19.2598 22.9127 4.3111 17.2589 26.3008 42.9491 3.6573 0.5866 434.0440 41.4587 102.6530 24.2938 31.7460 82.3714 214.7125 67.0294 25.5434 26.4908 24.6131 39.7834 12.3790 16.7087 13.5343 20.9363 377.7982 18.7780 384.6258 264.9180 5.1698 51.9634 26.7208 34.2725 22.4863 2.7920 23.3121 13.1695 1.5942 49.6854 249.2905
temp: 298.150 k
press: 1.00000 atm
elementType: 8 8 8 8 7 6 6 6 6 6 6 6 1 1 1 1 1 1 1 1 1 1 1
symmnumber: 1
zpe: 471993.8 jmol-1
zpe.correction: 0.179773 hartree
zpe.thermalcorrener: 0.193284 hartree
zpe.thermalcorrenthalpy: 0.194228 hartree
zpe.thermalcorrgfe: 0.138246 hartree
zpe.sumelectzpe: -628.064716 hartree
zpe.sumelectthermal: -628.051205 hartree
zpe.sumelectthermalent: -628.050261 hartree
zpe.sumelectthermalfe: -628.106243 hartree
dipole: 3.1953 -1.3896 0.2070
dipole: 3.4905
quadrupole: -52.7361 -74.5423 -68.8724
quadrupole: -1.9292 -0.9090 0.6686
quadrupole: 12.6475 -9.1588 -3.4888 -1.9292 -0.9090 0.6686
hfenergy: -628.2444887 hartree
pointgroup: C01 [X(C7H11N1O4)]
dipole: -1.2872776 0.3056455 0.3679816 debye
dipolederiv: -1.2363453 0.4181581 -0.0289448 0.6622537 -0.678595 -0.0817528 -0.0064381 -0.1233008 -0.399141 -1.5445474 -0.4288636 -0.1377727 -0.6398185 -0.6019697 -0.1549728 -0.3288732 -0.2014939 -0.449705 -0.7319681 -0.0434977 -0.1580552 0.2772968 -0.6666548 -0.2115816 0.0833484 -0.3468778 -0.6254884 -0.8053249 0.0029008 0.1272897 0.1002057 -0.5508038 -0.2654385 0.2795426 -0.2357228 -0.7325424 -0.6131002 0.0598206 0.0128051 -0.4894615 -0.896072 -0.2011796 -0.4989561 -0.3133815 -0.7529845 -0.3374559 0.0669646 -0.0565259 0.006774 0.0514004 0.0262254 -0.0681471 -0.0342922 -0.0925027 1.0289256 0.249623 0.0216255 0.8332676 0.6384047 0.3430632 0.465737 0.5375379 0.5120969 -1.5531829 -0.3645429 -0.1060116 -0.2277328 -0.3764857 0.0661526 0.1211047 0.096806 -0.2453163 1.4080194 -0.3714181 0.2238145 -0.8569415 0.9870658 0.3140101 0.049573 0.4986927 0.6908539 2.2074646 0.5055609 -0.0028656 0.3862271 0.6914523 0.4010657 -0.2078084 0.3548005 0.7471869 0.6063084 -0.1148112 0.0500809 -0.0594713 0.2748385 -0.0436085 0.1423551 -0.0781083 0.2670002 0.7688724 0.1248694 0.0013283 0.0462153 0.2795401 -0.0256374 -0.1245425 -0.0576603 0.2521677 0.071822 -0.0165685 -0.0233318 0.0105715 0.0100085 -0.0905865 -0.0022757 -0.0657428 0.0717482 -0.007234 -0.0309251 0.0148314 -0.0650603 0.0031289 0.0717607 0.0145616 0.0486789 0.0657591 0.0790976 0.0065154 0.0547727 0.016943 0.1155751 -0.1110095 0.0550716 -0.1095776 0.0505021 0.3167034 0.001543 0.0268124 0.0009016 0.333769 -0.0314859 0.0273851 -0.034128 0.2813191 0.4722567 -0.0485381 0.0033358 -0.0089793 0.3567117 -0.0117087 -0.0112508 -0.0338353 0.2733302 0.0072507 0.0770645 0.0120912 0.1156802 0.0010746 -0.0590692 0.041546 -0.0775959 0.071546 -0.0234493 -0.0189148 -0.0166152 -0.1219975 -0.0573984 0.027295 -0.0518215 0.0479352 0.0818993 -0.0072947 0.0040953 0.0589459 -0.0130081 0.0936134 0.0293561 -0.0401068 0.0801284 -0.0872919 -0.0207411 -0.0128258 -0.0284612 0.0138891 0.0738954 0.0573472 0.0941144 0.104432 -0.106981 -0.0558841 0.0154869 -0.0018948 0.1337228 -0.0953385 0.0337177 0.0569897 0.0368794 0.0881189 -0.0301929 -0.0816968 -0.0472547 -0.1214776 0.0128397 -0.0819628 -0.091109 -0.0941736 0.0384248 unknown
polarizability: 153.1983463|10.8856078|78.9666735|4.0981725|15.8257906|78.0129157 unknown
InChI: InChI=1S/C7H11NO4/c1-11-6(9)3-5(8)4-7(10)12-2/h3H,4,8H2,1-2H3
charge 0 multiplicity 1
23 atoms
O  -3.468485 0.658429 0.417256
O  3.368109 0.954276 0.708081
O  -2.770217 -1.123666 -0.901407
O  2.687049 -0.575178 -0.927478
N  0.062803 -1.28734 -0.8359
C  -1.343231 -0.318005 0.958413
C  -0.004011 -0.433499 0.230272
C  1.096759 0.280311 0.705268
C  -2.563482 -0.325272 0.047803
C  2.394775 0.15482 0.080819
C  -4.724611 0.717022 -0.376923
C  4.720492 0.877362 0.118319
H  -1.357509 0.586613 1.582335
H  -1.447398 -1.190823 1.635718
H  0.994891 0.949574 1.559927
H  0.980503 -1.372323 -1.298532
H  -0.790959 -1.716519 -1.200154
H  -5.304281 1.530005 0.080519
H  -5.260073 -0.244629 -0.311592
H  -4.492782 0.935165 -1.432367
H  4.700652 1.18265 -0.942092
H  5.114916 -0.151466 0.183858
H  5.327987 1.570992 0.717656
