program: Gaussian 09
title: 000250057
version: EM64L-G09RevD.01
frameworkgroup: C1[X(C14H16N2OS)]
method: RPBEPBE
basis: SDD
operation: Freq
keyword: #p
keyword: freq=noraman
keyword: PBEPBE/SDD
title: #p freq=noraman PBEPBE/SDD
converged: YES YES NO NO
title: Mulliken charges:
elementType: S O N N C C C C C C C C C C C C C C H H H H H H H H H H H H H H H H
charge: 0.209171 -0.273684 -0.133449 -0.068730 -0.386773 -0.229772 0.473323 -0.788246 -0.679425 -0.375190 -0.378690 0.200748 -0.287444 -0.221270 -0.221687 -0.288274 -0.112389 -0.236140 0.214719 0.214806 0.223036 0.223056 0.291024 0.295970 0.213249 0.225098 0.213267 0.238681 0.237896 0.227333 0.227442 0.266305 0.256417 0.229622
chargesum: 0.00000
title: Mulliken charges with hydrogens summed into heavy atoms:
elementType: S O N N C C C C C C C C C C C C C C
charge: 0.209171 -0.273684 -0.133449 -0.068730 0.042752 0.216320 0.473323 -0.201251 -0.027811 -0.136509 -0.140794 0.200748 -0.287444 0.006062 0.005755 -0.021968 0.144028 -0.006518
polarizability: 3.23665436e+02 -4.56258767e+00 1.44002593e+02 -8.31237954e-01 9.00908985e-02 1.31343659e+02
1716.lowfreq: -5.2699 -2.6564 -0.0014 -0.0007 0.0025 5.9403 12.0925 24.2314 36.9983
frequency: 11.9479 24.1980 36.9959 39.4516 56.6578 74.1775 80.4672 102.4010 120.5665 158.2416 207.5958 217.8010 247.4442 280.1694 314.3993 322.2550 330.0780 394.8129 401.9318 430.9065 473.4153 495.6216 507.3065 555.4879 615.3445 616.7493 645.7275 671.2859 701.8295 730.6264 758.1191 776.0236 797.6041 809.3860 827.7494 851.4242 878.3311 883.0835 894.6289 926.1215 950.1311 966.9015 970.5814 976.8135 989.9191 996.4587 1026.4731 1047.3037 1055.1883 1072.3506 1119.2488 1124.8310 1135.3525 1142.0616 1147.2379 1172.9518 1187.7142 1217.8544 1224.3645 1240.7854 1256.9355 1275.8690 1280.4300 1309.5884 1324.6675 1348.4734 1380.0041 1384.3207 1394.1805 1439.6339 1442.6876 1470.1662 1478.4780 1478.7963 1483.9768 1489.8298 1499.8173 1571.3837 1593.1496 1614.0036 2979.9004 2996.8936 3003.8165 3042.5081 3053.1348 3064.7274 3084.1146 3085.0589 3122.0288 3124.3593 3128.0658 3137.1237 3148.6830 3154.2146 3165.0689 3182.3342
redmass: 4.1787 3.8403 5.0651 3.6109 3.3290 2.1816 4.6813 5.2670 5.7484 3.5080 5.3228 1.1085 4.0679 5.6302 4.3869 2.4436 4.2780 7.2708 2.8117 9.6136 3.8715 4.2953 3.8359 5.9241 8.0764 6.3431 5.3512 9.2936 1.6499 6.6872 1.0750 2.1683 8.8447 3.9638 1.5223 1.2507 1.1489 1.5327 1.9847 1.4549 4.9375 1.3200 4.3457 1.3915 6.1398 1.3231 2.1949 3.2567 3.1954 1.4698 1.0920 1.8609 1.8996 1.4512 4.6758 1.0524 1.1131 1.8503 1.2662 1.7321 2.8025 1.1018 2.4264 1.6710 1.2803 2.2204 1.9819 8.8225 1.2306 2.0799 1.1488 1.0846 1.0550 1.0479 2.3597 1.1495 3.8250 6.5517 6.1108 6.1414 1.0359 1.0598 1.0575 1.1018 1.0582 1.1045 1.0992 1.1046 1.0854 1.0906 1.1052 1.0921 1.0965 1.0903 1.1017 1.0990
irintensity: 0.2261 0.2520 0.3045 1.6932 1.1243 3.8712 0.7339 0.4273 3.9158 7.5410 0.3017 0.0304 3.1541 6.6460 0.7844 1.6474 3.6770 0.1850 0.0104 1.3446 5.0068 1.4887 0.1233 20.4569 3.9452 0.1719 48.0027 35.8673 60.7563 0.0997 6.1053 27.5520 1.9805 8.9013 43.2375 0.0250 1.8950 0.6989 9.4555 2.6909 174.5007 0.2440 2.9875 0.0077 0.4234 0.0820 7.8798 0.2440 13.0259 9.0241 1.6792 90.3578 1.3193 0.2211 17.8292 0.0250 1.2753 0.2829 0.3272 45.3771 136.8622 0.0370 100.9711 3.2351 0.2389 417.4591 123.4159 0.1281 11.2870 8.9940 12.3352 4.9595 4.6570 9.3382 11.7470 31.1770 19.2739 17.0016 0.9655 2.4974 33.1442 4.3773 40.8261 0.2430 5.9186 0.0395 47.6308 92.1380 5.6720 0.3296 2.9672 16.3450 40.8252 2.2442 25.9256 4.4350
temp: 298.150 k
press: 1.00000 atm
elementType: 16 8 7 7 6 6 6 6 6 6 6 6 6 6 6 6 6 6 1 1 1 1 1 1 1 1 1 1 1 1 1 1 1 1
symmnumber: 1
zpe: 705924.2 jmol-1
zpe.correction: 0.268872 hartree
zpe.thermalcorrener: 0.286808 hartree
zpe.thermalcorrenthalpy: 0.287752 hartree
zpe.thermalcorrgfe: 0.218643 hartree
zpe.sumelectzpe: -1124.516030 hartree
zpe.sumelectthermal: -1124.498094 hartree
zpe.sumelectthermalent: -1124.497150 hartree
zpe.sumelectthermalfe: -1124.566260 hartree
dipole: -0.8138 0.7173 0.0824
dipole: 1.0879
quadrupole: -92.2729 -112.0949 -108.9390
quadrupole: -1.6564 -0.1953 -0.1846
quadrupole: 12.1627 -7.6593 -4.5034 -1.6564 -0.1953 -0.1846
hfenergy: -1124.7849022 hartree
pointgroup: C01 [X(C14H16N2O1S1)]
dipole: -0.3295898 0.2720151 0.0239665 debye
polarizability: 323.7652009|1.552545|143.8915164|-1.0926019|-0.346516|131.35497 unknown
InChI: InChI=1S/C14H16N2OS/c1-2-10-17-13-8-9-14(16-15-13)18-11-12-6-4-3-5-7-12/h3-9H,2,10-11H2,1H3
charge 0 multiplicity 1
34 atoms
S  1.433608 1.363905 -0.083266
O  -4.409609 0.456407 0.011949
N  -2.206639 -0.397887 -0.038398
N  -0.839252 -0.180738 -0.06221
C  -6.401412 -0.92152 0.048828
C  -4.873507 -0.963236 0.011469
C  3.554828 -0.46645 -0.046077
C  2.048086 -0.458084 -0.113094
C  -6.997919 -2.346792 0.053689
C  4.221422 -0.482343 1.20699
C  4.331655 -0.463847 -1.23382
C  -3.046529 0.673283 -0.012875
C  -0.369378 1.097968 -0.05841
C  5.632076 -0.499853 1.271873
C  5.742814 -0.481137 -1.171841
C  -2.600603 2.029624 -0.010153
C  -1.224832 2.244824 -0.033371
C  6.397234 -0.499199 0.081942
H  -6.726861 -0.368481 0.949821
H  -6.77033 -0.356179 -0.827408
H  -4.443673 -1.47741 0.891222
H  -4.486786 -1.462659 -0.896363
H  1.65105 -0.900782 -1.038878
H  1.568017 -0.952276 0.744675
H  -6.658481 -2.9223 0.935123
H  -8.101185 -2.308932 0.080995
H  -6.7023 -2.910286 -0.850991
H  3.630088 -0.481449 2.130522
H  3.826311 -0.449376 -2.207061
H  6.13358 -0.516078 2.24599
H  6.329843 -0.482532 -2.097076
H  -3.326117 2.846341 0.009876
H  -0.806105 3.255442 -0.032298
H  7.491805 -0.514366 0.131425
