program: Gaussian 09
title: 000253811
version: EM64L-G09RevD.01
frameworkgroup: C1[X(C15H15NO2)]
method: RPBEPBE
basis: SDD
operation: Freq
keyword: #p
keyword: freq=noraman
keyword: PBEPBE/SDD
title: #p freq=noraman PBEPBE/SDD
converged: YES YES NO NO
title: Mulliken charges:
elementType: O O N C C C C C C C C C C C C C C C H H H H H H H H H H H H H H H
charge: -0.360329 -0.238398 -0.457920 0.334900 0.273371 0.482863 -0.505662 -0.376884 -0.437657 -0.816376 -0.808043 0.486947 0.220154 -0.443225 -0.345839 -0.195457 -0.214079 -0.256117 0.250924 0.230797 0.230207 0.229383 0.223099 0.268725 0.228221 0.234602 0.223764 0.333309 0.223038 0.297065 0.227312 0.227544 0.229759
chargesum: 0.00000
title: Mulliken charges with hydrogens summed into heavy atoms:
elementType: O O N C C C C C C C C C C C C C C C
charge: -0.360329 -0.238398 -0.124611 0.334900 0.273371 0.482863 -0.254738 -0.146087 -0.207450 -0.095169 -0.121457 0.486947 0.220154 -0.220187 -0.048774 0.031856 0.013465 -0.026358
polarizability: 2.73926697e+02 3.00404502e+00 1.44279809e+02 -9.53531758e+00 1.28364931e+01 1.24239126e+02
1716.lowfreq: -5.3853 -0.9236 -0.0008 0.0004 0.0006 6.5589 14.8484 24.7763 28.1424
frequency: 14.4244 24.5537 28.0576 55.4215 80.6126 86.1004 128.1804 147.6450 167.0960 200.0933 244.8251 252.4686 286.3726 295.7997 324.7512 339.3835 406.9811 434.5867 448.2924 476.9723 509.1761 528.1479 558.1108 613.4594 641.9017 644.8982 681.7113 692.0301 697.3293 719.6217 736.6307 749.4864 767.0392 822.2643 841.1322 845.5183 889.0544 896.4799 914.0938 954.8857 956.7778 972.0394 985.0041 996.2355 1000.9951 1009.0761 1028.1656 1047.1717 1051.0144 1089.5287 1098.5290 1142.1641 1156.7814 1173.0729 1190.1186 1208.5494 1250.1997 1263.2874 1278.7932 1326.1635 1367.4220 1385.6895 1396.2329 1398.2814 1408.5898 1433.7103 1464.8377 1470.6407 1472.0607 1485.5217 1486.3887 1502.1651 1515.0419 1582.0368 1601.6048 1618.1123 1632.6192 1685.1233 2977.5308 2981.6233 3056.1204 3063.3019 3085.7973 3090.1471 3114.3897 3121.0923 3133.3027 3142.6402 3145.7418 3147.2439 3166.3161 3189.2278 3540.2546
redmass: 1.0349 4.8503 3.8611 5.3386 6.6390 5.1215 2.3661 2.0520 1.7614 4.6855 4.2367 5.0914 4.4996 2.9802 3.4582 6.4340 2.9177 4.1932 3.0043 4.0288 2.8455 6.6386 4.1605 6.3822 1.3908 6.8148 4.9130 3.3612 2.3439 5.3553 3.9415 4.5737 1.6652 1.2786 1.2645 5.1161 1.7847 3.0866 1.4307 1.6818 1.9212 1.3568 5.9805 1.3050 2.1572 1.3401 2.1314 1.5452 1.5296 1.5997 3.2018 3.4189 1.4147 1.0498 1.1116 1.7012 3.9704 2.3687 1.4225 1.4042 5.0174 6.9895 1.2907 1.2367 3.2640 2.3617 1.0545 1.0645 1.0809 1.2911 1.7003 3.1176 2.3175 5.5937 5.3280 6.0555 7.3634 9.3234 1.0373 1.0366 1.0975 1.0977 1.0987 1.0994 1.0884 1.0873 1.0869 1.0937 1.0934 1.0953 1.0996 1.0954 1.0760
irintensity: 0.4037 0.3998 0.6173 0.8233 2.3608 1.2633 1.6050 2.5621 3.7703 1.3455 1.7509 4.5747 2.8551 3.2331 1.0444 1.7962 0.0080 2.6020 8.2633 0.7506 25.5670 10.5965 3.4025 1.2699 21.3621 0.6787 8.8027 6.8694 75.5065 0.8517 0.5411 8.0227 104.2497 35.9408 0.4140 2.5458 8.3538 46.1526 12.6962 50.6430 82.6398 0.0585 0.0079 1.9588 82.9314 2.4238 0.0823 3.4890 15.6496 88.4798 340.9659 385.0674 3.6852 0.4872 4.0074 2.0077 70.0044 15.9492 0.0991 48.8094 16.3856 62.6377 19.5615 2.9622 32.2240 116.0151 18.9394 11.3505 6.9389 68.7541 5.8314 175.6690 406.5258 5.2667 28.3250 102.8555 6.9937 245.0597 40.0236 22.7428 20.8245 10.8596 20.1340 24.3168 13.8174 11.1497 0.6044 27.3806 29.8412 8.0034 24.2538 6.0060 31.7920
temp: 298.150 k
press: 1.00000 atm
elementType: 8 8 7 6 6 6 6 6 6 6 6 6 6 6 6 6 6 6 1 1 1 1 1 1 1 1 1 1 1 1 1 1 1
symmnumber: 1
zpe: 689228.8 jmol-1
zpe.correction: 0.262513 hartree
zpe.thermalcorrener: 0.279379 hartree
zpe.thermalcorrenthalpy: 0.280324 hartree
zpe.thermalcorrgfe: 0.214904 hartree
zpe.sumelectzpe: -784.537461 hartree
zpe.sumelectthermal: -784.520595 hartree
zpe.sumelectthermalent: -784.519651 hartree
zpe.sumelectthermalfe: -784.585071 hartree
dipole: 0.0362 -0.8922 -1.8457
dipole: 2.0503
quadrupole: -87.0590 -100.1365 -105.4096
quadrupole: -0.6777 -4.1585 2.1643
quadrupole: 10.4761 -2.6015 -7.8746 -0.6777 -4.1585 2.1643
hfenergy: -784.7999747 hartree
pointgroup: C01 [X(C15H15N1O2)]
dipole: 0.0235859 0.0378643 -0.8054253 debye
polarizability: 273.2934208|12.7879045|129.7909104|-5.7618069|15.2856003|139.3613009 unknown
InChI: InChI=1S/C15H15NO2/c1-11-8-9-12(2)14(10-11)18-15(17)16-13-6-4-3-5-7-13/h3-10,16H,1-2H3
charge 0 multiplicity 1
33 atoms
O  -0.689904 0.04041 -0.870578
O  0.287304 -0.064681 1.292152
N  1.554265 0.005438 -0.714358
C  -2.539045 1.203546 0.295721
C  -2.03063 0.052768 -0.357212
C  -4.178779 -1.116761 -0.241562
C  -2.816248 -1.080405 -0.629465
C  -3.902023 1.151599 0.67787
C  -4.707642 0.019835 0.418489
C  -1.679511 2.420531 0.568509
C  -5.032226 -2.342147 -0.519394
C  2.901882 -0.032205 -0.259376
C  0.400569 -0.011341 0.048028
C  3.922761 -0.006664 -1.247147
C  3.250153 -0.091621 1.115739
C  5.278947 -0.038725 -0.865457
C  4.613533 -0.122893 1.479896
C  5.634419 -0.096692 0.50239
H  -2.355755 -1.930124 -1.145462
H  -4.338396 2.02055 1.184511
H  -5.759231 0.021951 0.72846
H  -1.096053 2.71231 -0.324066
H  -2.300827 3.280117 0.870914
H  -0.957131 2.214043 1.379606
H  -4.995523 -2.627872 -1.586968
H  -4.681826 -3.21497 0.063585
H  -6.08817 -2.164785 -0.252838
H  1.399236 0.046441 -1.724237
H  3.654294 0.038637 -2.310474
H  2.463535 -0.113928 1.872763
H  6.05652 -0.018389 -1.636887
H  4.876897 -0.16903 2.542545
H  6.688006 -0.121641 0.7995
