program: Gaussian 09
title: 000250047
version: EM64L-G09RevD.01
frameworkgroup: C1[X(C14H13ClN4O)]
method: RPBEPBE
basis: SDD
operation: Freq
keyword: #p
keyword: freq=noraman
keyword: PBEPBE/SDD
title: #p freq=noraman PBEPBE/SDD
converged: YES YES NO NO
title: Mulliken charges:
elementType: Cl O N N N N C C C C C C C C C C C C C C H H H H H H H H H H H H H
charge: -0.014089 -0.261850 -0.408181 -0.053073 -0.424327 0.060080 0.487206 0.543918 0.171257 -0.288570 -0.322325 -0.377514 -0.394331 -0.395585 -0.808686 -0.392582 -0.237031 -0.234988 -0.238331 0.268967 0.254141 0.214327 0.222936 0.232825 0.317724 0.241843 0.242884 0.249767 0.294982 0.227761 0.230498 0.232571 0.357778
chargesum: 0.00000
title: Mulliken charges with hydrogens summed into heavy atoms:
elementType: Cl O N N N N C C C C C C C C C C C C C C
charge: -0.014089 -0.261850 -0.090458 -0.053073 -0.066549 0.060080 0.487206 0.543918 0.171257 -0.034429 -0.107998 -0.154579 -0.161506 -0.395585 -0.074191 -0.097601 -0.009271 -0.004490 -0.005760 0.268967
polarizability: 5.00495893e+02 8.49242596e+00 2.19377653e+02 4.93666931e-01 -1.02936330e+00 7.86607759e+01
1716.lowfreq: -0.0013 0.0021 0.0021 1.4359 3.6518 5.8913 17.2850 27.5002 35.8473
frequency: 16.7544 27.4880 35.8066 60.2970 74.9523 99.5729 115.8465 130.1581 141.8094 175.4075 198.5209 224.7641 241.7187 247.5772 265.9941 307.0077 339.4460 345.9457 398.1860 403.3650 474.2433 492.4118 506.7528 512.5362 543.9227 546.4175 568.1823 615.0477 617.4590 624.9579 640.5139 692.9654 693.5201 713.0158 734.9347 767.5309 787.9008 828.8341 843.5565 866.3680 875.2038 898.6203 921.8054 977.3706 983.3718 986.2476 988.4881 1000.6073 1010.7671 1026.3454 1028.4943 1030.5189 1084.6244 1094.8535 1117.0439 1173.8564 1191.0741 1208.8098 1226.3613 1254.1047 1288.2626 1303.9538 1328.0743 1345.9286 1379.8560 1387.8683 1394.1099 1425.0740 1432.2024 1441.6721 1477.6618 1479.4036 1486.5140 1520.6953 1522.1187 1580.1374 1600.7962 1608.9813 1633.2094 1641.1512 2962.4142 3033.4933 3108.2637 3110.3061 3122.2962 3123.7817 3128.6063 3140.3555 3150.5082 3166.8824 3213.4676 3413.9816 3532.8491
redmass: 5.4068 5.0622 6.7169 4.5985 4.9600 7.0552 7.6824 2.1823 6.1594 1.3288 3.3165 8.6128 4.0645 5.2344 4.4964 4.9697 6.6123 4.2123 9.4736 2.7752 2.6425 4.8050 6.2390 5.4926 3.0911 7.3653 6.4248 6.2518 1.9402 5.3180 2.2851 5.8008 1.6986 5.0766 1.4371 1.7674 7.5524 4.6342 1.2967 1.3127 1.7107 4.4907 1.4656 1.3656 2.3878 1.2528 4.3139 1.2951 3.7148 2.3299 4.5835 1.5730 1.6406 3.8899 4.5665 1.0654 1.1251 3.0683 2.3642 2.0698 1.6018 1.4764 1.5011 2.0832 1.9549 5.3582 1.2947 3.9648 1.5271 2.3571 1.4838 1.0468 2.3989 4.0336 3.1508 5.5796 4.3576 5.8923 5.3560 6.6177 1.0404 1.0974 1.0947 1.0917 1.0872 1.0869 1.0865 1.0912 1.0962 1.1015 1.0922 1.0746 1.0790
irintensity: 0.1577 0.5431 0.4881 0.2484 2.1703 1.1481 2.4007 3.4727 0.8065 1.0014 0.9480 3.4322 0.2266 2.0912 0.0025 12.7046 1.5370 4.3715 12.1166 0.1051 17.4988 10.9213 0.2126 12.0900 0.5268 1.9701 10.4402 1.0238 23.1846 4.1690 56.7414 26.7847 48.7504 0.0019 118.9214 62.2145 30.1365 2.6812 0.0578 25.0670 0.6331 52.1743 0.0370 2.2845 14.9593 34.7202 4.5294 12.5526 20.4341 1.2752 49.6934 5.8097 13.4494 20.2155 150.9961 0.2402 1.7801 9.1440 5.1696 0.0645 76.7899 14.5676 6.6453 7.8607 66.6951 7.2325 24.0164 213.2496 29.4582 35.5801 22.1598 19.0198 39.5246 41.0595 3.1408 6.1153 349.7166 1.1586 305.7767 872.1654 12.7569 14.8880 4.7249 0.3100 1.7129 38.6924 13.1647 2.3887 43.5062 41.7709 1.3016 16.9537 96.0615
temp: 298.150 k
press: 1.00000 atm
elementType: 17 8 7 7 7 7 6 6 6 6 6 6 6 6 6 6 6 6 6 6 1 1 1 1 1 1 1 1 1 1 1 1 1
symmnumber: 1
zpe: 648885.2 jmol-1
zpe.correction: 0.247147 hartree
zpe.thermalcorrener: 0.265553 hartree
zpe.thermalcorrenthalpy: 0.266497 hartree
zpe.thermalcorrgfe: 0.197797 hartree
zpe.sumelectzpe: -1294.106671 hartree
zpe.sumelectthermal: -1294.088265 hartree
zpe.sumelectthermalent: -1294.087321 hartree
zpe.sumelectthermalfe: -1294.156021 hartree
dipole: -6.4231 2.2924 -0.0032
dipole: 6.8200
quadrupole: -146.8661 -106.0404 -129.0295
quadrupole: -1.1758 -0.1174 -0.3911
quadrupole: -19.5541 21.2716 -1.7175 -1.1758 -0.1174 -0.3911
hfenergy: -1294.3538183 hartree
pointgroup: C01 [X(C14H13Cl1N4O1)]
dipole: 2.5547332 0.8117155 -0.1178401 debye
polarizability: 499.6202723|-17.8571317|218.6775872|-1.8436708|-14.736252|80.236462 unknown
InChI: InChI=1S/C14H13ClN4O/c1-10(7-8-11-5-3-2-4-6-11)17-18-12-9-16-19-14(20)13(12)15/h2-9,18-19H,1H3
charge 0 multiplicity 1
33 atoms
Cl -4.707531 2.000771 -0.175229
O  -6.401692 -0.614091 0.164122
N  -1.810993 1.024741 -0.058737
N  -0.460701 0.718231 -0.027496
N  -4.548332 -2.035118 0.342004
N  -3.220549 -2.366574 0.38213
C  3.803458 -0.176831 0.012962
C  -2.758693 0.022612 0.073384
C  0.399794 1.728185 -0.154999
C  2.378037 0.168434 -0.014667
C  1.833011 1.425284 -0.132015
C  4.85117 0.79097 -0.056224
C  4.169236 -1.552089 0.114156
C  -4.131442 0.296844 0.042156
C  -0.039666 3.175918 -0.325179
C  -2.352499 -1.361087 0.25098
C  6.201611 0.395495 -0.027702
C  5.521998 -1.948227 0.142439
C  6.546318 -0.975839 0.071192
C  -5.143125 -0.738147 0.177284
H  1.674786 -0.671884 0.064369
H  2.490541 2.298756 -0.221894
H  4.608872 1.856883 -0.13076
H  3.377853 -2.309807 0.169339
H  -2.15405 1.987705 -0.18093
H  -0.652339 3.522987 0.531301
H  -0.640112 3.316649 -1.246699
H  0.831636 3.844078 -0.397295
H  -1.293114 -1.613585 0.281784
H  6.991694 1.152896 -0.081453
H  5.778224 -3.010509 0.220104
H  7.598726 -1.279224 0.093172
H  -5.198923 -2.819131 0.444302
