program: Gaussian 09
title: 000253796
version: EM64L-G09RevD.01
frameworkgroup: C1[X(C14H12N4O5)]
method: RPBEPBE
basis: SDD
operation: Freq
keyword: #p
keyword: freq=noraman
keyword: PBEPBE/SDD
title: #p freq=noraman PBEPBE/SDD
converged: NO YES NO YES
title: Mulliken charges:
elementType: O O O O O N N N N C C C C C C C C C C C C C C H H H H H H H H H H H H
charge: -0.252826 -0.190106 -0.270164 -0.213735 -0.208128 -0.414545 0.023883 -0.015732 0.015109 0.309151 0.263157 0.446816 -0.499198 -0.290976 -0.369197 0.460779 -0.376828 -0.342709 0.332528 -0.378055 -0.348710 -0.340521 -0.536625 0.335793 0.291768 0.292332 0.348604 0.228695 0.264145 0.221222 0.247900 0.258554 0.227344 0.227346 0.252930
chargesum: 0.00000
title: Mulliken charges with hydrogens summed into heavy atoms:
elementType: O O O O O N N N N C C C C C C C C C C C C C C
charge: -0.252826 -0.190106 -0.270164 -0.213735 -0.208128 -0.065940 0.023883 -0.015732 0.015109 0.309151 0.263157 0.446816 -0.163405 0.000792 -0.076865 0.460779 -0.148133 -0.078564 0.332528 -0.156833 -0.100810 -0.081967 0.170995
polarizability: 6.10059718e+02 -5.29063072e+00 2.45839283e+02 -1.52339252e-03 5.27398695e-03 7.90942008e+01
1716.lowfreq: -6.7596 -3.3927 -0.0009 -0.0003 0.0006 3.2623 25.9811 27.1348 32.6079
frequency: 25.8986 27.1271 32.6079 55.5327 64.7110 75.3622 110.3862 121.0587 148.2949 149.2304 163.7718 180.8755 196.1386 237.9122 250.2383 273.3602 301.5001 325.2518 354.1793 358.3749 388.5565 393.0608 422.4773 445.9436 458.7334 470.0736 509.6029 513.5741 529.6899 574.2996 618.2812 631.7242 649.6161 667.9188 670.1456 704.9900 721.9830 736.6666 743.4471 754.5769 809.1147 812.1108 840.6065 848.9268 860.4369 872.2374 903.0919 933.9135 962.9580 963.4978 981.3673 986.1458 997.6381 1009.1348 1040.3346 1062.8027 1100.5663 1111.8032 1116.0589 1137.6992 1154.9529 1165.2234 1177.8896 1210.9562 1230.7242 1236.1047 1256.1522 1299.3768 1301.2761 1321.6257 1344.1731 1361.4386 1380.2291 1404.4961 1434.6173 1438.2871 1449.7336 1468.0045 1469.8357 1479.3237 1498.9148 1517.8432 1551.0378 1573.9369 1590.0683 1620.1304 1623.3403 2969.7576 2995.0716 3062.4402 3125.8163 3134.7627 3156.2650 3168.6195 3177.4790 3179.9446 3189.4034 3192.8384 3200.7325
redmass: 4.7821 4.8151 7.3045 8.1754 7.6638 10.8935 4.3686 7.1841 9.1720 5.4194 5.6756 6.6106 1.6670 1.7347 4.2907 5.5524 8.8345 5.3229 7.5307 10.3248 8.5479 4.4292 3.1509 4.3546 5.2021 6.1732 8.0786 3.6828 2.4356 5.7117 6.7696 7.2789 7.8647 6.0378 10.8618 7.8506 5.0069 3.6185 5.7178 11.4900 5.9751 1.3235 1.1867 1.5136 1.3737 5.9762 5.1363 1.3828 1.4695 1.4454 8.7180 1.3517 2.6231 1.3173 3.2259 2.9149 4.1585 1.2591 1.3448 1.3359 1.3268 7.7889 1.2506 4.4577 1.8596 2.3194 2.7392 2.0813 1.4609 2.0789 4.6641 7.3788 4.6368 3.0613 1.8760 1.8173 5.6258 1.0497 1.0849 3.0439 2.5910 3.8803 6.6738 5.9174 4.4868 6.2142 7.1396 1.0326 1.0877 1.1045 1.0897 1.1001 1.0880 1.0940 1.0975 1.0893 1.0914 1.0800 1.0962
irintensity: 2.2494 0.0307 0.1833 0.5588 2.4054 0.6780 1.4263 0.8940 1.5534 3.9772 6.6109 0.1853 0.9147 1.7988 17.7496 9.8233 2.6651 6.5489 5.6239 7.9789 11.1222 0.2578 0.3313 1.2550 7.3121 20.4521 0.9576 16.7715 17.0084 25.6287 3.3164 14.1475 15.6739 1.2121 12.2687 7.6389 2.1143 0.3091 3.7361 6.9708 2.0969 27.2800 131.9482 8.1843 19.5845 4.5567 2.7572 17.0570 0.9481 51.8999 95.8102 0.4484 11.3533 0.0168 4.6384 80.4156 60.4101 0.1411 21.8198 53.1688 27.7076 389.3174 334.0968 698.9060 227.8332 92.9791 209.8148 101.9551 14.0820 146.0904 214.3513 42.0572 7.8735 21.0004 72.2530 12.9674 2.1088 15.4240 72.4124 65.0536 193.4935 3.3036 87.7410 60.6204 120.6639 668.5342 244.2787 107.2342 27.6897 41.2711 11.0310 21.2585 1.7739 19.7820 7.6480 3.6322 16.9905 67.5668 0.2160
temp: 298.150 k
press: 1.00000 atm
elementType: 8 8 8 8 8 7 7 7 7 6 6 6 6 6 6 6 6 6 6 6 6 6 6 1 1 1 1 1 1 1 1 1 1 1 1
symmnumber: 1
zpe: 655077.7 jmol-1
zpe.correction: 0.249506 hartree
zpe.thermalcorrener: 0.269659 hartree
zpe.thermalcorrenthalpy: 0.270603 hartree
zpe.thermalcorrgfe: 0.198297 hartree
zpe.sumelectzpe: -1133.981576 hartree
zpe.sumelectthermal: -1133.961422 hartree
zpe.sumelectthermalent: -1133.960478 hartree
zpe.sumelectthermalfe: -1134.032785 hartree
dipole: -12.0914 0.8581 0.0009
dipole: 12.1218
quadrupole: -135.9108 -146.0862 -134.3849
quadrupole: -5.3578 0.0002 0.0041
quadrupole: 2.8831 -7.2922 4.4091 -5.3578 0.0002 0.0041
hfenergy: -1134.2310818 hartree
pointgroup: C01 [X(C14H12N4O5)]
dipole: 4.7580156 -0.3247558 -0.0000686 debye
polarizability: 610.0856047|-4.3079908|245.8133079|-0.0674415|-0.1149083|79.0942892 unknown
InChI: InChI=1S/C14H12N4O5/c1-23-12-5-2-10(3-6-12)9-15-16-13-7-4-11(17(19)20)8-14(13)18(21)22/h2-9,16H,1H3
charge 0 multiplicity 1
35 atoms
O  6.981866 1.310826 -0.001891
O  -4.195646 -3.061011 0.002501
O  -1.920232 -3.175265 0.002073
O  -5.398549 3.10075 -0.001309
O  -6.549005 1.12494 0.000146
N  -0.499475 -0.992228 0.000676
N  -3.043207 -2.486596 0.001952
N  0.695643 -0.288141 -0.000052
N  -5.449984 1.806482 -0.000334
C  -1.701369 -0.323259 0.000362
C  -2.964968 -1.02796 0.001062
C  -4.173607 1.073129 -0.000115
C  -4.190231 -0.325854 0.000833
C  -1.740479 1.111289 -0.000666
C  -2.948362 1.800673 -0.000889
C  3.123442 -0.427415 -0.000139
C  4.266198 -1.273101 0.000486
C  3.323493 0.988457 -0.00131
C  5.746574 0.664601 -0.00125
C  1.794728 -1.026529 0.000422
C  5.571296 -0.743312 -0.000053
C  4.61346 1.527304 -0.001862
C  8.194792 0.482918 -0.001491
H  -5.134326 -0.876365 0.001362
H  -0.78482 1.638237 -0.001233
H  -2.9823 2.893157 -0.001633
H  -0.566506 -2.033585 0.001594
H  4.1316 -2.361907 0.001402
H  2.447989 1.644658 -0.00178
H  1.747667 -2.133277 0.001364
H  6.429456 -1.420902 0.000472
H  4.783294 2.60795 -0.002764
H  8.244851 -0.151237 -0.906872
H  8.245327 -0.149644 0.904977
H  9.028089 1.199712 -0.002341
