program: Gaussian 09
title: 000253763
version: EM64L-G09RevD.01
frameworkgroup: C1[X(C5H9ClOS)]
method: RPBEPBE
basis: SDD
operation: Freq
keyword: #p
keyword: freq=noraman
keyword: PBEPBE/SDD
title: #p freq=noraman PBEPBE/SDD
converged: YES YES NO NO
title: Mulliken charges:
elementType: Cl S O C C C C C H H H H H H H H H
charge: -0.084777 0.169267 -0.455165 -0.649447 -0.265694 -0.765642 0.233132 -0.551534 0.265264 0.251630 0.207667 0.218813 0.275895 0.307843 0.352856 0.254189 0.235703
chargesum: 0.00000
title: Mulliken charges with hydrogens summed into heavy atoms:
elementType: Cl S O C C C C C
charge: -0.084777 0.169267 -0.102309 -0.132553 0.160787 -0.181904 0.233132 -0.061642
polarizability: 1.20792001e+02 9.73295275e+00 7.87613427e+01 -3.31882546e+00 -4.07234506e+00 5.91888941e+01
1716.lowfreq: -15.1740 -13.0568 -0.0025 -0.0021 0.0015 9.6834 43.9283 54.0147 108.6329
frequency: 43.7375 53.9048 108.6045 124.8108 164.5391 222.8120 268.8249 353.4128 373.2303 441.2723 476.7073 520.3044 560.0582 615.1844 641.4936 712.8282 818.1722 885.8081 913.0368 922.7904 938.1128 1007.4231 1031.9485 1101.8126 1150.4633 1193.0052 1207.6849 1241.2849 1283.2970 1336.2551 1368.5689 1402.6220 1418.5330 1446.2897 1454.8797 1653.1396 2976.8053 3019.7187 3025.6956 3054.1527 3095.5280 3104.7913 3114.1231 3228.5385 3488.8008
redmass: 4.4987 5.2422 4.0563 6.0905 7.1249 4.1536 2.3082 2.6730 2.9437 2.5886 4.5980 1.2123 4.2782 4.2728 1.8036 1.6632 2.1095 1.4817 2.0602 1.3496 1.9978 1.6962 3.3429 1.5782 1.1101 1.3017 1.4103 1.1994 1.2560 1.1816 1.2083 1.1335 1.0911 1.1085 1.0840 6.0716 1.0618 1.0600 1.0571 1.1006 1.1057 1.1076 1.0637 1.1147 1.0667
irintensity: 5.2567 2.1909 9.1820 4.6826 1.6018 0.0264 1.7689 9.7945 3.3904 18.5949 40.5285 104.9772 55.6651 22.4215 6.8766 9.7305 3.3330 8.5775 22.1933 82.4400 8.3137 3.4951 51.5044 35.6250 5.9464 9.7125 36.4716 7.9501 22.8809 5.7596 7.4351 8.6616 15.7806 8.3201 6.0641 52.8739 60.0855 16.5388 15.7025 39.7867 16.3851 0.6759 1.6198 2.4367 93.1290
temp: 298.150 k
press: 1.00000 atm
elementType: 17 16 8 6 6 6 6 6 1 1 1 1 1 1 1 1 1
symmnumber: 1
zpe: 344315.2 jmol-1
zpe.correction: 0.131143 hartree
zpe.thermalcorrener: 0.141157 hartree
zpe.thermalcorrenthalpy: 0.142102 hartree
zpe.thermalcorrgfe: 0.094474 hartree
zpe.sumelectzpe: -1128.588557 hartree
zpe.sumelectthermal: -1128.578542 hartree
zpe.sumelectthermalent: -1128.577598 hartree
zpe.sumelectthermalfe: -1128.625225 hartree
dipole: -0.0619 -2.1277 0.5471
dipole: 2.1978
quadrupole: -53.0310 -67.5666 -65.2713
quadrupole: 0.4989 -2.8493 -5.8461
quadrupole: 8.9253 -5.6103 -3.3150 0.4989 -2.8493 -5.8461
hfenergy: -1128.7196994 hartree
pointgroup: C01 [X(C5H9Cl1O1S1)]
dipole: 0.2407376 -0.6619206 -0.5015571 debye
dipolederiv: -0.3631971 0.1540846 0.0584867 0.1454563 -0.3858678 -0.2771756 0.0484823 -0.3086282 -0.367246 -0.3676705 0.0584684 -0.0124994 -0.0264443 -0.1224936 -0.1149416 0.0043286 -0.0806037 -0.0958031 -0.6830664 -0.1125861 0.103765 -0.0394415 -0.6955011 -0.1600426 0.1079032 -0.1778117 -0.3665613 0.3168733 -0.0740123 0.0835892 -0.1601913 -0.0364163 -0.0351043 0.1229384 -0.0498433 0.0598675 0.3692004 0.1760001 -0.0403565 0.1537064 0.4852785 0.032806 -0.1170288 0.1053431 0.2655525 0.2144664 0.1682715 -0.0538598 0.2058342 0.0105936 -0.0656726 -0.1426565 -0.0857315 -0.0285422 0.5109798 -0.2998346 -0.0986666 -0.2801337 0.454492 0.504203 0.0361535 0.6112848 0.4362947 -0.4238157 0.0214358 0.0700675 0.0232679 -0.2834592 0.1027869 0.0212083 0.0610105 -0.2055188 -0.0138482 0.0486672 0.0363716 0.065227 0.0648022 0.0655624 -0.0076934 0.0110744 -0.1133669 -0.0747447 -0.089563 -0.0282854 -0.0600645 -0.0465908 -0.0094001 -0.0240429 0.0027086 0.0996561 0.0429792 -0.0428265 0.0450932 -0.0916954 -0.0097196 0.0499388 0.1260181 0.0308801 -0.1405731 -0.13403 0.0267253 -0.0890474 0.1151939 0.0117971 0.0291434 -0.1035686 0.0026072 0.0514397 -0.0502716 -0.0252485 0.0835189 -0.0123806 0.034641 -0.07435 0.0728505 -0.0584222 -0.0190113 0.0552476 -0.0083292 -0.0456818 -0.0663815 0.0179034 0.0523313 -0.0349935 0.0344167 0.0781226 0.419986 -0.0482017 -0.0687633 -0.0171703 0.2858009 0.1062442 -0.0331517 0.1050769 0.202849 0.0785187 -0.0135901 -0.0676667 0.0070653 0.1486155 -0.0884608 -0.0910393 -0.0918973 0.0814822 0.1023927 0.0605391 0.0239347 0.0381518 0.0661242 -0.1178683 0.0142917 -0.1114644 0.0613586 unknown
polarizability: 122.3867079|-3.4465345|71.1493701|6.3302377|8.5310119|65.2061601 unknown
InChI: InChI=1S/C5H9ClOS/c1-5(6)4-8-3-2-7/h7H,1-4H2
charge 0 multiplicity 1
17 atoms
Cl 1.060566 1.071358 1.547243
S  -0.613717 -1.782588 0.162796
O  -1.90869 1.257385 -0.102595
C  -2.179566 -1.151739 -0.706777
C  -2.78905 0.088143 -0.035432
C  0.704079 -0.649727 -0.65161
C  1.715179 -0.172758 0.343228
C  3.010343 -0.541686 0.448257
H  -1.922751 -0.947602 -1.760178
H  -2.882932 -2.003382 -0.676127
H  -3.068318 -0.147204 1.012075
H  -3.701745 0.385229 -0.583905
H  1.209245 -1.232462 -1.438544
H  0.148502 0.190681 -1.10047
H  -1.192581 1.174424 0.582701
H  3.680803 -0.129667 1.206344
H  3.418035 -1.2846 -0.246104
