program: Gaussian 09
title: 000250041
version: EM64L-G09RevD.01
frameworkgroup: C1[X(C13H13BrN4O)]
method: RPBEPBE
basis: SDD
operation: Freq
keyword: #p
keyword: freq=noraman
keyword: PBEPBE/SDD
title: #p freq=noraman PBEPBE/SDD
converged: YES YES NO NO
title: Mulliken charges:
elementType: Br O N N N N C C C C C C C C C C C C C H H H H H H H H H H H H H
charge: 0.051259 -0.259337 -0.051458 -0.408426 -0.426244 0.063656 0.097334 -0.536214 0.324857 -0.665164 -0.372469 -0.356153 0.563162 -0.250157 -0.229028 -0.233182 -0.481774 -0.399238 0.281650 0.245687 0.219396 0.230871 0.238635 0.226334 0.225218 0.260410 0.292830 0.228449 0.230586 0.233077 0.296874 0.358557
chargesum: 0.00000
title: Mulliken charges with hydrogens summed into heavy atoms:
elementType: Br O N N N N C C C C C C C C C C C C C
charge: 0.051259 -0.259337 -0.051458 -0.115596 -0.067687 0.063656 0.097334 -0.071131 0.324857 0.030677 -0.147250 -0.095743 0.563162 -0.021709 0.001558 -0.000105 -0.481774 -0.102364 0.281650
polarizability: 3.81237348e+02 3.80097845e+00 2.11925235e+02 -1.62577571e-02 2.72690288e+00 8.28142757e+01
1716.lowfreq: -9.4169 -5.0974 -3.5904 0.0003 0.0005 0.0006 16.6166 32.6621 46.3132
frequency: 15.9551 32.6337 46.3047 49.5412 70.6551 91.1574 110.0586 134.0492 182.0111 192.8815 198.8117 235.5166 249.7720 264.9657 271.7456 323.8520 346.2671 396.8939 403.7406 453.7934 492.6516 508.8221 529.5968 543.9662 584.4695 608.8343 615.8532 641.4028 658.3322 667.6267 695.5631 718.3982 739.0787 740.6953 771.2366 778.4724 826.2365 848.1309 868.9538 921.4438 926.6139 976.2741 980.9784 988.0696 1002.2106 1008.3192 1022.2088 1034.2132 1059.1908 1082.6775 1098.3704 1099.9159 1116.5638 1174.1047 1192.1827 1220.8556 1235.4651 1282.0950 1300.5046 1313.4268 1331.4394 1378.3683 1382.7730 1393.8089 1422.1352 1425.4998 1436.2378 1473.7839 1484.2882 1485.8271 1506.0211 1525.1498 1547.7361 1585.7898 1593.3988 1611.8559 1636.5026 2974.4323 2987.7520 3057.6633 3086.0939 3090.4957 3127.7005 3136.4069 3149.4990 3162.0976 3173.5034 3213.4582 3399.7216 3533.0481
redmass: 4.9389 4.3404 6.3190 5.2433 3.1130 7.2517 8.6339 5.4617 7.5065 1.7041 1.6936 5.2682 7.8676 5.0783 6.8896 4.7391 3.5515 4.3042 3.0717 4.9891 3.6387 7.6991 5.7595 7.6180 3.1389 1.9022 6.3860 3.0310 4.5065 4.1946 1.7087 4.8077 1.4502 3.8150 1.9828 1.9583 2.2150 1.2590 1.3166 2.8203 1.4382 4.2884 1.4137 5.4119 1.3371 5.4953 2.9832 2.4181 1.9161 1.8587 2.0742 3.0879 3.0494 1.0547 1.1241 3.9575 1.4496 1.7248 1.3967 1.4751 2.0716 2.4137 4.2109 1.2081 5.0975 1.6799 2.2009 1.0436 1.5813 1.3671 2.0738 1.5753 5.7583 6.1526 4.5244 5.9994 6.6610 1.0698 1.0354 1.0919 1.0992 1.1008 1.0847 1.0882 1.0931 1.0966 1.0987 1.0922 1.0746 1.0790
irintensity: 0.1309 0.6125 0.3798 0.0129 0.0581 3.0718 1.5580 0.0826 4.7150 1.1678 1.2571 1.6935 0.1408 1.0228 0.1326 9.9006 4.7879 10.4093 3.1693 4.6627 3.2555 1.2865 5.3835 5.0396 26.5968 30.2334 0.5517 36.6670 9.1738 6.1724 48.2233 0.1631 120.1064 28.6202 19.7589 51.7925 7.7923 0.0920 26.4223 16.7326 4.0492 59.0434 0.6589 0.5231 0.2247 24.5626 11.6697 0.1467 32.2622 13.2495 36.5540 8.0304 90.9357 0.0608 1.0528 3.5977 8.2191 50.9839 8.3760 6.1547 10.9249 46.4127 6.5535 14.6968 249.8845 3.5829 8.6885 10.5793 1.1775 6.9499 21.9519 30.2595 27.1440 24.5862 381.6737 11.5999 894.1442 23.5733 23.4685 5.8231 41.3451 26.5171 3.3670 3.2474 30.7253 30.2120 15.1253 1.4149 9.4497 93.8720
temp: 298.150 k
press: 1.00000 atm
elementType: 35 8 7 7 7 7 6 6 6 6 6 6 6 6 6 6 6 6 6 1 1 1 1 1 1 1 1 1 1 1 1 1
symmnumber: 1
zpe: 635558.6 jmol-1
zpe.correction: 0.242071 hartree
zpe.thermalcorrener: 0.259749 hartree
zpe.thermalcorrenthalpy: 0.260693 hartree
zpe.thermalcorrgfe: 0.193319 hartree
zpe.sumelectzpe: -809.469625 hartree
zpe.sumelectthermal: -809.451948 hartree
zpe.sumelectthermalent: -809.451004 hartree
zpe.sumelectthermalfe: -809.518377 hartree
dipole: -6.2337 -1.9100 -0.0676
dipole: 6.5201
quadrupole: -133.5397 -108.0595 -124.7624
quadrupole: 4.8906 -0.1182 -0.1062
quadrupole: -11.4192 14.0610 -2.6419 4.8906 -0.1182 -0.1062
hfenergy: -809.7116963 hartree
pointgroup: C01 [X(C13H13Br1N4O1)]
dipole: -2.5265325 0.4434828 -0.016879 debye
polarizability: 379.5051589|16.9407336|213.5211124|5.25935|3.915542|82.9505874 unknown
InChI: InChI=1S/C13H13BrN4O/c1-2-10(9-6-4-3-5-7-9)16-17-11-8-15-18-13(19)12(11)14/h3-8,17-18H,2H2,1H3
charge 0 multiplicity 1
32 atoms
Br 3.448787 2.43613 0.328564
O  5.682267 0.146641 0.079127
N  -0.40781 0.034378 0.106193
N  0.825647 0.660288 0.153679
N  4.220961 -1.66865 -0.111628
N  3.011372 -2.303581 -0.177357
C  -1.504767 0.776769 0.21001
C  -1.484885 2.29462 0.360974
C  -2.798671 0.045869 0.134203
C  -1.386886 3.032758 -1.005022
C  -4.032053 0.741241 -0.012766
C  -2.83269 -1.378392 0.200898
C  1.991481 -0.08523 0.068518
C  -5.2546 0.038869 -0.090477
C  -4.052207 -2.076056 0.126759
C  -5.272924 -1.371602 -0.019319
C  3.25871 0.511165 0.124973
C  1.928542 -1.529151 -0.089341
C  4.487661 -0.265621 0.037403
H  -2.392625 2.623225 0.893436
H  -0.643244 2.607923 1.012509
H  -1.365883 4.126646 -0.853654
H  -2.252822 2.790375 -1.645631
H  -0.475182 2.747917 -1.560955
H  -4.049248 1.833977 -0.080346
H  -1.888635 -1.917956 0.317533
H  0.925677 1.679563 0.261333
H  -6.191638 0.594281 -0.20789
H  -4.056244 -3.170042 0.187368
H  -6.222059 -1.915778 -0.074757
H  0.959669 -2.024387 -0.143969
H  5.041098 -2.277889 -0.179666
