program: Gaussian 09
title: 000253938
version: EM64L-G09RevD.01
frameworkgroup: C1[X(C20H23NO7S)]
method: RPBEPBE
basis: SDD
operation: Freq
keyword: #p
keyword: freq=noraman
keyword: PBEPBE/SDD
title: #p freq=noraman PBEPBE/SDD
converged: YES YES NO NO
title: Mulliken charges:
elementType: S O O O O O O O N C C C C C C C C C C C C C C C C C C C C H H H H H H H H H H H H H H H H H H H H H H H
charge: 0.944224 -0.243302 -0.400215 -0.298914 -0.277017 -0.499171 -0.502567 -0.254648 -0.582267 -0.130423 -0.025763 -0.139167 -0.072949 -0.375102 -0.052606 0.223453 -0.502849 0.247902 -0.252606 -0.185988 -0.338328 -0.437830 0.453963 -0.345661 -0.323487 -0.801439 -0.221747 -0.228481 -0.225482 0.303718 0.259858 0.255852 0.224440 0.246746 0.242589 0.280567 0.298462 0.228573 0.242907 0.211642 0.284495 0.351753 0.244327 0.244162 0.269480 0.263655 0.236576 0.227801 0.238894 0.232721 0.228538 0.230709
chargesum: 0.00000
title: Mulliken charges with hydrogens summed into heavy atoms:
elementType: S O O O O O O O N C C C C C C C C C C C C C C C C C C C C
charge: 0.944224 -0.243302 -0.400215 -0.298914 -0.277017 -0.499171 -0.502567 -0.254648 -0.003238 0.173294 0.234095 0.116685 0.151491 0.114233 -0.052606 0.223453 0.180273 0.247902 0.031889 0.165765 -0.094000 -0.193668 0.453963 -0.076181 -0.059832 -0.098167 0.010974 0.000057 0.005227
polarizability: 3.54941169e+02 -1.97079093e+01 2.63202297e+02 -1.73594916e+01 1.85221084e+01 2.30722187e+02
1716.lowfreq: -39.0382 -7.1560 -4.9627 -0.1150 -0.0013 0.0002 0.0005 14.4048 21.1219
frequency: -39.0237 14.2333 20.9680 27.0340 40.4573 48.4155 51.4954 63.2979 79.8411 82.6270 91.0412 97.8403 109.7615 121.8534 135.3862 148.8693 155.8458 163.1326 182.4403 196.8989 201.1686 212.9002 240.7107 256.8938 272.0293 281.2912 307.8969 323.8677 329.4094 350.2385 361.2155 385.2233 401.7849 402.6897 407.7571 424.8015 430.0964 438.6042 462.8054 473.4421 499.8886 506.3564 538.9928 551.0084 585.6681 600.8675 613.8883 622.0871 651.4101 673.8093 681.0889 696.6886 701.9179 735.1004 778.8417 792.2999 795.2586 820.8533 824.6143 827.6820 851.2972 855.5425 860.7511 873.7177 899.5906 934.1201 949.1741 951.4935 962.4316 964.3648 976.7416 984.1685 990.2011 992.5847 994.2317 995.9633 998.0566 1006.7309 1015.7934 1037.3632 1046.4895 1049.7304 1051.1292 1052.3886 1086.2090 1112.3923 1117.4350 1128.2803 1140.3382 1148.1431 1171.4644 1173.1753 1182.3335 1190.2770 1198.4752 1220.3284 1241.0005 1264.6862 1294.8638 1302.8389 1310.7505 1315.7893 1318.5207 1328.6375 1348.8096 1354.4178 1360.4860 1375.2929 1378.1589 1390.6266 1391.6311 1401.0390 1426.2656 1437.9825 1444.3852 1454.1250 1470.2092 1474.2585 1475.9101 1478.4850 1478.6863 1586.1061 1589.3362 1592.0874 1612.3077 1622.0880 1628.7096 2958.5244 2982.0800 2992.6688 3004.9924 3017.2976 3020.9169 3033.2857 3057.6862 3061.0731 3091.4425 3117.8292 3120.5733 3128.3160 3128.6305 3135.7782 3141.9384 3142.8535 3155.2535 3166.8405 3168.1678 3181.0287 3497.6145 3632.8739
redmass: 1.0294 5.5162 4.2129 6.6824 4.3390 5.2282 4.1734 7.3115 4.9154 4.0272 5.3481 3.8703 2.6218 5.9045 1.8220 4.8215 5.1630 5.5806 5.6685 5.5698 4.0831 6.0435 4.9073 6.4463 9.1670 4.3457 5.8270 1.3846 2.9089 4.4739 4.0400 4.0776 5.4804 2.8127 2.9790 4.7467 5.8842 4.0673 2.3477 3.5254 3.0226 2.7658 4.9931 4.8936 6.2670 6.3220 6.4352 6.9916 7.0732 5.0059 5.0441 1.6532 3.2752 5.8283 4.9261 2.1628 5.0744 4.1258 1.4244 8.4147 2.6956 1.5102 1.2539 3.8888 2.7616 5.7047 9.2430 1.5064 4.4937 1.3231 6.4983 2.2878 4.0091 1.5346 2.1747 2.7886 1.7187 1.3373 3.8865 2.6480 2.8578 1.5955 2.4809 2.4358 1.6432 1.2628 1.3982 1.3271 2.0810 1.5422 2.3470 1.0557 1.1312 1.3400 1.1297 3.1478 3.3105 1.2940 1.2651 1.1633 1.2575 1.3487 1.5541 1.2216 1.2687 1.3133 1.5760 1.4108 5.5613 9.9939 2.5019 1.3169 1.1463 2.2522 1.0872 1.0519 1.0451 1.4387 1.5188 1.9169 1.1586 6.6613 6.6132 5.8918 6.1198 1.2085 5.7547 1.0348 1.0375 1.0855 1.0841 1.0830 1.0736 1.0735 1.0991 1.0974 1.0989 1.1020 1.1054 1.0896 1.0856 1.0899 1.0895 1.0974 1.0942 1.0960 1.0981 1.0967 1.0443 1.1006
irintensity: 0.4315 0.5687 0.0707 1.3271 0.4588 2.2713 0.6035 0.6079 0.1104 1.4857 2.6995 1.0506 2.1132 0.4363 3.7731 0.5988 3.2349 2.6797 3.1286 2.5727 11.1984 1.5926 6.2691 5.4624 3.1061 11.4050 13.7800 50.7810 4.8582 7.9357 8.8004 15.6187 4.8119 0.1711 0.0733 7.8632 16.5939 2.3509 146.5392 158.6882 148.8794 125.0906 8.6742 58.4983 15.8673 13.7519 0.4995 2.7917 7.1013 12.9352 15.3076 81.9660 6.5630 15.1224 4.7014 26.5205 36.0324 1.9011 62.7336 76.9533 1.3102 14.3145 0.5099 40.4506 17.5622 28.3170 127.2316 2.6424 90.7436 2.0283 26.9418 1.5806 14.1408 0.7169 16.0996 16.3583 36.8993 1.1073 216.1524 88.3248 106.7258 16.4013 31.7962 30.0496 12.3301 0.2822 14.1727 5.0608 23.3602 5.4163 2.7644 0.1606 32.8636 28.6966 14.3010 3.5627 257.2692 47.2298 4.0172 9.2502 3.3693 6.3626 11.1688 16.8936 5.6505 2.4375 3.7992 3.3944 2.3800 2.6517 15.0774 17.8863 10.2030 16.7374 11.2864 8.3077 13.5070 20.4434 24.1070 9.9965 4.2060 22.4415 1.6152 13.8159 11.1483 23.3012 186.1579 67.1046 27.2685 47.2724 4.6030 20.5637 6.8791 38.1160 36.1226 15.9621 15.3992 21.1474 18.0685 43.3463 1.1229 5.2375 10.4107 32.8571 18.2157 7.3956 22.4173 5.2039 32.1037 10.3017
temp: 298.150 k
press: 1.00000 atm
elementType: 16 8 8 8 8 8 8 8 7 6 6 6 6 6 6 6 6 6 6 6 6 6 6 6 6 6 6 6 6 1 1 1 1 1 1 1 1 1 1 1 1 1 1 1 1 1 1 1 1 1 1 1
symmnumber: 1
zpe: 1049984.2 jmol-1
zpe.correction: 0.399918 hartree
zpe.thermalcorrener: 0.428504 hartree
zpe.thermalcorrenthalpy: 0.429448 hartree
zpe.thermalcorrgfe: 0.338453 hartree
zpe.sumelectzpe: -1752.956147 hartree
zpe.sumelectthermal: -1752.927562 hartree
zpe.sumelectthermalent: -1752.926617 hartree
zpe.sumelectthermalfe: -1753.017613 hartree
dipole: 3.7342 -1.9164 -5.6066
dipole: 7.0037
quadrupole: -155.2317 -168.2235 -180.3381
quadrupole: -6.5693 -3.1893 8.1088
quadrupole: 12.6994 -0.2924 -12.4070 -6.5693 -3.1893 8.1088
hfenergy: -1753.3560652 hartree
pointgroup: C01 [X(C20H23N1O7S1)]
dipole: -1.4289231 0.3984712 2.3220543 debye
polarizability: 342.016825|-36.0690861|269.0239981|-31.0331039|-7.7110167|237.8248293 unknown
InChI: InChI=1S/C20H23NO7S/c1-13-8-10-15(11-9-13)29(23,24)28-17-16(21)12-26-20(25-2)18(17)27-19(22)14-6-4-3-5-7-14/h3-11,16-18,20H,12,21H2,1-2H3
charge 0 multiplicity 1
52 atoms
S  -0.875854 -0.999488 -2.029647
O  2.976003 -2.520826 1.455949
O  0.34089 -1.944713 -0.906495
O  1.287691 0.611504 0.303425
O  0.820365 -1.565917 2.011646
O  -1.366091 -1.942396 -3.251421
O  -0.180414 0.421528 -2.401787
O  2.792872 1.720158 -1.096613
N  4.024257 -2.584999 -1.27919
C  1.734825 -1.493581 -0.987364
C  2.143991 -0.586101 0.197179
C  2.612953 -2.806908 -0.982094
C  2.169569 -1.295386 1.56175
C  2.46588 -3.450663 0.405503
C  -2.28052 -0.864717 -0.785171
C  1.726009 1.732581 -0.436362
C  0.779115 -2.075717 3.393453
C  0.807404 2.892839 -0.298293
C  -3.585385 -0.945836 -1.304243
C  -1.987896 -0.703463 0.577031
C  -4.657605 -0.828707 -0.39558
C  -3.086828 -0.593469 1.461156
C  -4.426384 -0.646178 0.995244
C  1.142773 4.086408 -0.988903
C  -0.371433 2.838003 0.488958
C  -5.594423 -0.528772 1.957212
C  0.30766 5.217142 -0.890785
C  -1.20324 3.972615 0.585457
C  -0.867013 5.162821 -0.10274
H  1.901139 -0.933933 -1.928787
H  3.178516 -0.252025 -0.015334
H  2.167099 -3.480373 -1.737468
H  2.713931 -0.689492 2.31421
H  3.099815 -4.344699 0.498286
H  1.405553 -3.688855 0.604441
H  4.255166 -2.196892 -2.194577
H  4.589597 -2.232858 -0.504188
H  -0.282213 -2.27287 3.608667
H  1.365039 -3.007911 3.485768
H  1.174585 -1.319445 4.101844
H  -3.756641 -1.108384 -2.372752
H  -0.955935 -0.710053 0.946704
H  -5.685653 -0.884052 -0.771973
H  -2.892981 -0.473855 2.533435
H  2.053132 4.102567 -1.59691
H  -0.626038 1.912403 1.011322
H  -6.257829 0.311351 1.679879
H  -5.253806 -0.363101 2.993048
H  -6.21267 -1.445917 1.947719
H  0.566705 6.136156 -1.42737
H  -2.114984 3.929529 1.191226
H  -1.5175 6.041644 -0.027665
