program: Gaussian 09
title: 000253806
version: EM64L-G09RevD.01
frameworkgroup: C1[X(C21H14O3)]
method: RPBEPBE
basis: SDD
operation: Freq
keyword: #pfreq=noraman
keyword: PBEPBE/SDD
title: #p freq=noraman PBEPBE/SDD
converged: YES YES NO NO
title: Mulliken charges:
elementType: O O O C C C C C C C C C C C C C C C C C C C C C H H H H H H H H H H H H H H
charge: -0.201630 -0.439908 -0.230180 -0.702441 0.295769 0.178387 0.276721 0.182655 -0.552607 -0.396976 0.387909 -0.422900 -0.391420 -0.382860 -0.234220 -0.236057 -0.032577 0.246080 0.099178 -0.356905 -0.338210 -0.228660 -0.222666 0.084139 0.247427 0.247767 0.259153 0.242177 0.242710 0.242036 0.274492 0.227340 0.228211 0.263120 0.281641 0.238169 0.237414 0.387720
chargesum: 0.00000
title: Mulliken charges with hydrogens summed into heavy atoms:
elementType: O O O C C C C C C C C C C C C C C C C C C C C C
charge: -0.201630 -0.052188 -0.230180 -0.207248 0.295769 0.178387 0.276721 0.182655 -0.293454 -0.154798 0.387909 -0.180190 -0.149383 -0.108368 -0.006880 -0.007845 -0.032577 0.246080 0.099178 -0.093785 -0.056569 0.009508 0.014748 0.084139
polarizability: 3.72195579e+02 4.36688526e-01 2.26110650e+02 -3.03905476e+01 9.84118696e+00 1.64721343e+02
1716.lowfreq: -6.2708 -5.0242 -0.0007 -0.0005 -0.0003 2.8060 14.4693 26.1799 43.0476
frequency: 14.4426 26.1678 43.0444 50.9509 83.4153 109.9090 119.9344 135.0690 147.7312 175.4237 216.8448 233.1976 241.8103 289.1802 301.8482 317.4369 366.7719 383.5935 413.1845 416.3193 437.8788 473.7322 486.8245 501.3727 511.3042 546.4406 565.9901 580.9090 591.1122 597.5865 629.7606 644.0439 679.6072 684.3306 696.6506 722.3311 737.7430 747.4401 761.5437 779.7503 789.4127 792.0152 817.3674 853.3240 863.7135 871.6331 896.5262 899.6480 944.1700 948.0682 971.3362 975.7808 988.6329 992.7289 995.7805 1000.5214 1004.5764 1025.3121 1041.8110 1095.3880 1100.5083 1119.9302 1130.9740 1141.9201 1162.5193 1169.4133 1178.8248 1184.2673 1188.4092 1202.4918 1240.2718 1270.4021 1289.2427 1298.0003 1310.9090 1319.4752 1377.7181 1378.3710 1388.7639 1424.4654 1426.2609 1440.5573 1446.5029 1461.1154 1474.5055 1488.3455 1543.0803 1573.7935 1584.4098 1589.8519 1601.6599 1620.8337 1622.6327 1638.1651 2982.0154 3026.1314 3123.4311 3131.0180 3132.4173 3135.6680 3136.2197 3144.4045 3150.8820 3162.5972 3163.3425 3164.2937 3180.7188 3531.8606
redmass: 6.4350 4.5013 6.2545 7.0662 9.2767 5.3805 6.6603 3.9245 5.9077 5.6699 5.6305 4.4296 2.3866 5.6756 8.0694 6.1810 5.6691 7.2750 3.2276 2.7832 2.8861 4.0362 4.3753 5.0283 5.2737 5.7559 3.8534 3.8548 1.3746 3.6470 6.7660 6.1346 5.6058 4.1208 3.5396 2.8110 4.4371 1.9655 3.1514 2.4006 2.6588 2.2653 4.3956 5.0463 1.5199 1.4386 1.4501 1.5146 1.5373 3.5092 1.8672 1.4137 1.3447 1.4261 5.9122 4.6757 1.3921 2.1499 2.3658 2.2212 2.1213 1.7409 1.1528 1.5441 1.7452 1.1545 1.0832 1.6838 2.0491 1.9643 1.8316 1.7392 1.9275 1.7359 2.2736 2.6376 6.6354 9.9129 4.3429 1.2092 2.1767 4.2007 2.4142 2.7170 2.6421 3.6201 10.3956 6.9840 7.7326 6.6861 6.1995 7.2835 7.1962 8.7248 1.0608 1.0993 1.0857 1.0894 1.0914 1.0862 1.0890 1.0947 1.0911 1.0997 1.0964 1.0969 1.0974 1.0642
irintensity: 0.3964 0.0772 1.2624 0.4172 1.9595 0.9595 0.8974 1.0627 0.5905 4.4426 2.8640 0.5861 10.6413 1.1418 10.5159 0.1867 3.3312 12.6959 9.1104 7.8999 0.9713 15.3754 4.5243 5.3127 4.5963 0.3846 2.7816 7.7288 95.9493 34.5326 3.5882 15.3129 3.1205 22.9231 58.4874 34.5121 8.3067 68.5751 44.6332 33.6295 15.0685 14.1108 0.9842 19.5259 20.2695 0.2364 0.1958 1.9101 4.3451 44.5479 10.8106 3.7341 0.3587 6.0134 19.0153 221.7030 10.3009 1.6332 5.7225 25.1704 56.1217 28.1891 0.1754 15.3868 71.2701 1.6125 0.3447 2.2307 2.9088 6.8463 108.8604 39.8315 117.4424 87.2413 77.6146 81.0811 2.8314 16.7518 19.3139 12.9316 8.4637 11.2501 10.5789 1.9010 9.0464 12.4445 293.8732 22.9125 26.5519 0.2797 17.6924 5.2592 48.2108 248.6327 10.5351 6.4544 2.9763 5.1027 10.9682 2.0301 2.6168 29.7938 10.2444 32.2463 19.8291 13.3250 10.5398 48.7801
temp: 298.150 k
press: 1.00000 atm
elementType: 8 8 8 6 6 6 6 6 6 6 6 6 6 6 6 6 6 6 6 6 6 6 6 6 1 1 1 1 1 1 1 1 1 1 1 1 1 1
symmnumber: 1
zpe: 752355.2 jmol-1
zpe.correction: 0.286557 hartree
zpe.thermalcorrener: 0.305531 hartree
zpe.thermalcorrenthalpy: 0.306475 hartree
zpe.thermalcorrgfe: 0.237192 hartree
zpe.sumelectzpe: -1032.714799 hartree
zpe.sumelectthermal: -1032.695825 hartree
zpe.sumelectthermalent: -1032.694880 hartree
zpe.sumelectthermalfe: -1032.764163 hartree
dipole: -1.1751 -4.7015 -1.0972
dipole: 4.9687
quadrupole: -119.4064 -135.7798 -129.8561
quadrupole: -14.1607 -6.1679 0.0981
quadrupole: 8.9410 -7.4323 -1.5087 -14.1607 -6.1679 0.0981
hfenergy: -1033.0013558 hartree
pointgroup: C01 [X(C21H14O3)]
dipole: 0.4841214 1.8735767 0.277092 debye
polarizability: 370.1396059|-13.1665277|225.1159698|34.2035525|12.5597462|167.7719959 unknown
InChI: InChI=1S/C21H14O3/c22-20(18-7-3-4-8-19(18)21(23)24)14-9-10-17-15(12-14)11-13-5-1-2-6-16(13)17/h1-10,12,23H,11H2
charge 0 multiplicity 1
38 atoms
O  -2.40241 -2.40019 -1.298012
O  -3.185844 0.607297 2.93511
O  -2.159207 -1.207716 1.919778
C  2.189396 1.687177 0.042835
C  1.389477 0.413315 -0.203849
C  2.264899 -0.71701 -0.219826
C  3.618558 1.172079 0.17001
C  3.641929 -0.24869 0.011814
C  0.011094 0.250538 -0.397123
C  1.7495 -2.017777 -0.436958
C  -0.511774 -1.055933 -0.614895
C  4.808436 1.882398 0.40519
C  4.860432 -0.960766 0.089084
C  0.366701 -2.177122 -0.63612
C  6.030327 1.167389 0.482355
C  6.054288 -0.241868 0.325445
C  -1.965099 -1.293284 -0.859888
C  -2.946296 -0.13772 -0.710551
C  -3.338429 0.430967 0.537704
C  -3.525843 0.36625 -1.900328
C  -4.272188 1.500566 0.570536
C  -4.450462 1.432804 -1.862647
C  -4.820406 2.007285 -0.623898
C  -2.826457 -0.151774 1.807258
H  1.856981 2.212275 0.959946
H  2.084167 2.410386 -0.78978
H  -0.660488 1.116602 -0.392778
H  2.412739 -2.889549 -0.448126
H  4.798993 2.971626 0.527531
H  4.885428 -2.049695 -0.030321
H  -0.072824 -3.165047 -0.80745
H  6.966278 1.707209 0.664852
H  7.00858 -0.776495 0.388764
H  -3.247793 -0.088141 -2.856743
H  -4.564407 1.910644 1.540848
H  -4.883023 1.810017 -2.79571
H  -5.540042 2.831899 -0.590545
H  -2.838207 0.148253 3.746185
