program: Gaussian 09
title: 000250031
version: EM64L-G09RevD.01
frameworkgroup: C1[X(C12H10N2)]
method: RPBEPBE
basis: SDD
operation: Freq
keyword: #pfreq=noraman
keyword: PBEPBE/SDD
title: #p freq=noraman PBEPBE/SDD
converged: NO YES NO NO
title: Mulliken charges:
elementType: N N C C C C C C C C C C C C H H H H H H H H H H
charge: -0.130687 -0.053675 0.476431 -0.287991 -0.377766 -0.388543 -0.298453 0.170279 -0.235717 -0.236500 -0.237643 -0.273066 -0.186797 -0.319455 0.283690 0.223239 0.238195 0.213618 0.227091 0.230264 0.231696 0.238790 0.242120 0.250880
chargesum: 0.00000
title: Mulliken charges with hydrogens summed into heavy atoms:
elementType: N N C C C C C C C C C C C C
charge: -0.130687 -0.053675 0.476431 -0.004300 -0.154527 -0.150347 -0.084835 0.170279 -0.008627 -0.006236 -0.005947 -0.034276 0.055323 -0.068575
polarizability: 3.14112747e+02 7.41373693e+00 1.37531217e+02 1.63758894e-02 -1.46830049e-02 5.53778892e+01
1716.lowfreq: 0.0001 0.0004 0.0008 2.5437 8.8828 9.8445 35.3407 59.2078 77.3413
frequency: 35.1202 59.1390 77.3369 109.5832 192.6752 219.7087 273.2642 285.2431 353.5734 402.1495 467.1601 470.8334 535.9582 550.8762 615.1204 620.7660 655.1518 693.7016 742.9491 764.5891 805.9787 814.2340 845.8023 853.9438 884.4732 919.9657 925.4793 977.9893 982.8367 988.2818 989.5071 995.3804 1014.9290 1015.4693 1025.9303 1080.8534 1084.9901 1126.1151 1173.4612 1186.7433 1191.4708 1206.9979 1228.5328 1298.9544 1313.2566 1335.5082 1357.5471 1385.5421 1404.7613 1441.2384 1485.1193 1514.0217 1561.8460 1581.6049 1610.3381 1644.6198 3103.7113 3117.0821 3123.9484 3127.4520 3133.2157 3140.3644 3150.5285 3153.1349 3166.7044 3173.3796
redmass: 4.3222 4.9901 4.9351 3.9679 6.4538 2.4228 3.5614 5.2890 4.0801 2.7575 3.0475 4.4307 3.6923 6.9348 6.5749 7.9441 6.0967 1.7222 2.4089 1.5544 1.8752 5.9984 1.2794 4.4429 1.6784 1.4467 1.4929 1.3868 6.5980 6.1851 1.3709 1.3119 1.2092 3.2486 2.1895 2.1202 1.9247 2.3688 1.0677 1.3581 1.1856 2.7154 1.3778 2.0433 1.7457 1.3225 2.2508 5.0394 2.1924 2.3263 2.3300 4.3444 5.6877 5.6703 5.9476 5.6426 1.0928 1.0872 1.0852 1.0873 1.0892 1.0916 1.0964 1.0919 1.1016 1.1006
irintensity: 4.9940 0.8450 1.6278 1.6385 1.1728 0.1662 1.5426 3.3127 0.2560 0.0373 5.7995 3.8949 6.4183 15.6269 0.1848 0.0791 0.1627 47.7960 37.0371 17.5417 53.3608 1.2046 1.2668 0.4819 15.6783 3.3413 0.4536 0.2826 14.2996 0.0456 0.0019 4.8612 44.2695 1.1714 4.2330 18.9184 0.6487 4.1422 0.7175 2.6622 5.6883 23.8262 6.7785 11.3335 0.4734 18.8798 19.8177 0.5712 66.3390 20.3921 14.6601 0.5865 126.6933 7.6153 0.2934 98.1987 11.7838 6.6897 6.2017 0.8562 10.7383 5.4503 40.5067 9.1715 35.3332 22.8844
temp: 298.150 k
press: 1.00000 atm
elementType: 7 7 6 6 6 6 6 6 6 6 6 6 6 6 1 1 1 1 1 1 1 1 1 1
symmnumber: 1
zpe: 489082.1 jmol-1
zpe.correction: 0.186282 hartree
zpe.thermalcorrener: 0.197551 hartree
zpe.thermalcorrenthalpy: 0.198495 hartree
zpe.thermalcorrgfe: 0.147599 hartree
zpe.sumelectzpe: -571.763391 hartree
zpe.sumelectthermal: -571.752122 hartree
zpe.sumelectthermalent: -571.751177 hartree
zpe.sumelectthermalfe: -571.802073 hartree
dipole: -0.6418 4.0901 0.0226
dipole: 4.1402
quadrupole: -61.9497 -77.3848 -87.5232
quadrupole: 13.1755 0.0761 -0.0576
quadrupole: 13.6695 -1.7656 -11.9040 13.1755 0.0761 -0.0576
hfenergy: -571.9496722 hartree
pointgroup: C01 [X(C12H10N2)]
dipole: -0.2515273 1.6085006 -0.0524544 debye
dipolederiv: -0.4379974 -0.1492379 0.0024084 0.5768005 -0.0719798 0.0005474 -0.019317 -0.0063445 -0.2241197 -0.1920265 0.2262319 -0.0062666 -0.2538575 -0.0460471 -0.0083642 0.007672 -0.0042224 -0.2380812 -0.0702273 0.0366161 -0.0024429 0.0938389 -0.0322201 0.0034474 -0.0030303 0.0031291 0.0344116 0.7288027 -0.0065474 0.0082678 0.1355461 0.0948225 -0.004928 0.0024705 -0.0065072 -0.0959592 -0.0593252 0.0639336 -0.0024868 -0.0510745 0.0117956 -0.00754 0.0010212 -0.005996 -0.1440284 -0.0661591 -0.1049745 0.0053534 0.0653521 0.0623965 -0.0092295 0.0003001 -0.0107767 -0.1644219 -0.946108 -0.0545473 -0.0052209 -0.4689437 0.1041476 -0.0145543 0.00942 -0.011184 -0.2187055 1.4226225 0.0297154 0.0105792 -0.1868488 -0.1397353 0.0078627 0.0175717 0.0103247 0.1711665 -0.1401301 -0.0894568 0.0040216 -0.227003 0.1040929 -0.0132515 0.0107637 -0.0120491 -0.1473848 0.0057913 0.130174 -0.0041669 0.2335682 0.0579524 -0.0063621 -0.0095718 -0.0076418 -0.1457454 -0.012201 -0.0225404 0.0022602 0.0499535 -0.0329927 -0.0049074 -0.0008019 -0.0056944 -0.1618385 -0.6387667 -0.0123465 -0.0045219 -0.2372807 0.1056171 -0.0083259 0.002133 -0.0062876 -0.1039649 0.2864922 0.0735221 0.0010288 0.0331742 0.061588 -0.0037779 0.0026164 -0.0036201 -0.0748506 0.0541396 -0.1389159 0.0045649 0.1256121 -0.0628735 0.0027648 -0.0033186 0.0007124 -0.0109771 0.1017574 -0.0019823 -0.0002642 0.066961 -0.012001 0.0061778 -0.0038592 0.0057452 0.1492643 0.0355143 -0.1132818 0.0040658 -0.0790803 -0.0336567 0.0069798 0.0024709 0.0064824 0.1429169 0.062748 0.0956895 -0.0048103 0.0624164 -0.0533037 0.0095345 -0.0032006 0.0097698 0.1539203 0.0313409 0.0250325 -0.0019784 0.0941551 -0.095393 0.008931 -0.0039158 0.0085938 0.1596406 0.0220984 0.0702062 -0.0043339 0.117422 -0.0887173 0.0117833 -0.00627 0.0114589 0.1570813 -0.0170568 -0.0968095 0.0024626 -0.1312201 -0.0496518 0.0076981 0.0038083 0.0080293 0.1596039 -0.1410364 0.0207278 -0.0037687 0.0263711 0.0886597 0.0034565 -0.0039249 0.0033911 0.1626628 0.0903196 0.0775555 -0.0028441 0.0572006 -0.0699376 0.0069522 -0.0025071 0.0071104 0.1430555 -0.0239729 -0.0943522 0.0013789 -0.1355882 0.0098616 0.0028108 0.0026621 0.0031258 0.1421106 -0.0966194 0.0355879 -0.0032859 0.0325251 0.0875757 0.0022945 -0.0031926 0.0024509 0.1542427 unknown
polarizability: 314.0997094|7.380966|137.4150549|2.1572288|-2.9551553|55.5070889 unknown
InChI: InChI=1S/C12H10N2/c1-2-5-11(6-3-1)8-9-12-7-4-10-13-14-12/h1-10H
charge 0 multiplicity 1
24 atoms
N  2.333601 -1.052308 0.093596
N  3.657114 -1.399836 0.116265
C  -1.899463 -0.136497 0.027426
C  -0.447204 -0.355193 0.048387
C  -2.50155 1.155695 -0.033286
C  -2.757161 -1.274608 0.067646
C  0.535234 0.599776 0.026271
C  1.969374 0.288117 0.04863
C  -3.901934 1.298443 -0.052562
C  -4.159949 -1.132333 0.048928
C  -4.739683 0.155999 -0.011603
C  2.947324 1.326578 0.02635
C  4.302476 0.967329 0.049557
C  4.613348 -0.413707 0.094255
H  -0.106542 -1.399042 0.085982
H  -1.872001 2.051879 -0.066174
H  -2.309738 -2.274916 0.114523
H  0.284299 1.668436 -0.010486
H  -4.347085 2.298651 -0.100114
H  -4.799402 -2.021251 0.080802
H  -5.829014 0.271543 -0.026918
H  2.633593 2.375582 -0.008129
H  5.097273 1.71923 0.033801
H  5.644589 -0.77897 0.114353
