program: Gaussian 09
title: 000250019
version: EM64L-G09RevD.01
frameworkgroup: C1[X(C9H11BrN4O)]
method: RPBEPBE
basis: SDD
operation: Freq
keyword: #p
keyword: freq=noraman
keyword: PBEPBE/SDD
title: #p freq=noraman PBEPBE/SDD
converged: YES YES NO NO
title: Mulliken charges:
elementType: Br O N N N N C C C C C C C C C H H H H H H H H H H H
charge: 0.043927 -0.262799 -0.008616 -0.417828 -0.426622 0.062234 -0.422611 -0.428349 -0.495626 -0.527019 0.101950 0.557685 -0.477984 -0.408184 0.280229 0.231917 0.217737 0.230169 0.218337 0.234504 0.249711 0.243725 0.235983 0.306066 0.304497 0.356967
chargesum: 0.00000
title: Mulliken charges with hydrogens summed into heavy atoms:
elementType: Br O N N N N C C C C C C C C C
charge: 0.043927 -0.262799 -0.008616 -0.111762 -0.069655 0.062234 0.027042 0.020157 -0.011412 -0.047311 0.101950 0.557685 -0.477984 -0.103686 0.280229
polarizability: 2.49562270e+02 -1.22871786e+00 1.60194210e+02 -1.41890485e+00 -4.68077346e-01 7.26289237e+01
1716.lowfreq: -8.7271 -5.7344 -0.0008 -0.0006 -0.0005 4.4896 35.1707 49.4854 54.7560
frequency: 35.1130 49.4472 54.7331 82.9365 121.1177 158.6623 183.6922 196.7020 220.1203 246.8739 261.7280 317.8977 324.1100 453.4280 469.1803 510.6959 529.7965 549.5083 566.2194 580.0432 602.7290 638.7326 678.3088 718.5309 735.5019 757.2175 803.5790 837.5423 855.3268 874.9633 898.5016 912.3197 961.0693 977.7837 1007.0202 1010.7046 1051.3076 1078.4400 1100.1160 1133.6620 1154.2845 1202.8433 1207.4188 1222.2489 1239.2088 1272.1470 1289.0061 1299.2030 1314.1881 1317.4206 1380.2495 1421.6900 1428.2639 1447.4118 1449.8288 1473.6707 1482.5330 1513.8273 1597.1654 1622.9948 1637.0473 2957.0818 2978.9505 3001.2017 3003.7610 3017.1558 3071.6054 3074.4207 3086.3711 3211.0689 3410.8786 3534.3382
redmass: 3.8975 3.6573 6.5433 4.4270 4.3135 7.8847 7.1284 4.4030 2.0040 4.4369 9.0360 4.2452 5.0355 2.1923 6.7790 8.1483 7.3215 5.7962 1.9222 6.2236 1.5180 3.1771 3.4151 4.7070 1.4911 3.9849 2.5611 2.8260 2.0749 1.3036 2.5304 1.4508 3.4187 2.6845 1.7135 3.1830 1.9342 4.9749 3.4809 1.3398 1.5136 3.7196 1.4344 3.1843 1.7091 1.3068 1.4160 1.3487 1.4173 1.5751 1.9011 6.2991 1.4996 1.1381 1.0844 1.0839 1.1019 3.4249 4.9150 11.4081 6.8134 1.0609 1.0678 1.0767 1.0630 1.0865 1.0953 1.0989 1.1044 1.0924 1.0753 1.0790
irintensity: 0.0536 1.0369 0.4071 0.2202 3.7926 0.4621 3.6601 0.6030 1.3594 0.0197 0.5707 7.2761 7.0821 5.2502 11.0730 0.2269 10.0402 3.4819 13.1800 21.3093 40.6894 30.3946 22.5978 0.0080 117.6960 32.2403 5.3512 11.7314 6.2883 27.8848 0.9330 0.7892 48.6529 22.0480 9.7675 13.3054 3.4820 50.2399 69.1567 3.4910 4.6826 17.1634 3.8130 8.4309 3.0652 1.9802 15.1749 21.5426 0.5612 0.6472 31.1320 162.6604 3.5958 8.2011 12.6410 11.6362 3.9613 0.7597 304.8768 25.0289 767.8419 10.2057 15.1510 22.3138 32.6248 37.0975 28.2518 27.2644 51.1831 1.7807 11.9278 82.9654
temp: 298.150 k
press: 1.00000 atm
elementType: 35 8 7 7 7 7 6 6 6 6 6 6 6 6 6 1 1 1 1 1 1 1 1 1 1 1
symmnumber: 1
zpe: 519567.2 jmol-1
zpe.correction: 0.197893 hartree
zpe.thermalcorrener: 0.211792 hartree
zpe.thermalcorrenthalpy: 0.212736 hartree
zpe.thermalcorrgfe: 0.155021 hartree
zpe.sumelectzpe: -656.096043 hartree
zpe.sumelectthermal: -656.082144 hartree
zpe.sumelectthermalent: -656.081199 hartree
zpe.sumelectthermalfe: -656.138914 hartree
dipole: 7.3949 -0.3412 -0.0678
dipole: 7.4030
quadrupole: -99.0329 -97.3801 -97.7625
quadrupole: -9.1620 -0.0762 0.0418
quadrupole: -0.9744 0.6784 0.2960 -9.1620 -0.0762 0.0418
hfenergy: -656.2939355 hartree
pointgroup: C01 [X(C9H11Br1N4O1)]
dipole: 2.9059615 -0.1913901 0.0432849 debye
dipolederiv: -0.0424698 -0.1286528 -0.0003766 0.0116894 -0.585967 0.0023416 -0.0006634 -0.0017637 0.0127874 -1.3809225 0.3577215 -0.018664 0.5039805 -0.5609239 0.0095362 -0.0216058 0.0078199 -0.3691182 0.386609 -0.1915859 0.013042 -1.0986987 -0.1592482 -0.0119205 0.0290328 -0.0000535 -0.1325688 -1.8340427 0.1067587 -0.0228629 0.2976155 -0.0706238 -0.0004956 -0.0332001 -0.0002659 -0.2745355 -0.6030643 -0.2819202 -0.0041745 0.5640466 -0.2829134 0.0106624 -0.0080118 -0.0055401 -0.2833069 0.5130453 0.0408941 0.0115318 -0.4016323 -0.4147292 -0.0061018 0.0135953 0.0018594 -0.1178716 0.0823271 -0.0253963 0.0542884 0.0940293 0.0205325 -0.0261398 -0.0479258 -0.005553 0.1444431 0.1689899 0.0389117 -0.0102449 -0.0241629 0.0604399 -0.0491692 0.0646612 -0.0075567 0.1431924 -0.0894693 0.0143377 0.021921 0.0956386 -0.067856 0.0243749 -0.1176773 -0.0007772 0.1243732 -0.073892 -0.0042302 -0.016758 -0.0220522 -0.2082295 0.0099134 0.0490503 -0.0051929 0.207671 0.2226088 0.0535957 0.0033939 0.0558038 0.4280269 -0.0042495 0.0611449 -0.0171182 -0.0562612 2.0811738 -0.1581543 0.0323616 0.4074864 -0.1728545 0.0070199 0.0315477 -0.0032145 0.2228541 -1.4734597 0.3326156 -0.0221731 0.1920774 0.8926883 -0.0001948 -0.0244878 0.0042677 -0.2245492 -0.26645 0.0786574 -0.0029685 -0.3000108 0.1595148 -0.0060104 -0.0020899 0.0004108 -0.1080719 1.9373885 -0.3439008 0.0300457 -0.5050949 0.5513839 -0.0104296 0.0339098 -0.0075772 0.2797059 -0.1907361 0.0812865 -0.0383019 0.0869766 0.0384956 0.0126128 -0.0724289 0.023747 0.0698749 0.091034 -0.0164469 -0.012823 -0.0372636 0.0418056 0.0198982 0.0638931 -0.0041979 -0.1726576 -0.0409771 -0.0822245 0.0353277 -0.1332164 -0.088505 0.0549994 0.0682574 0.0784456 0.0527088 0.0252627 0.0131761 -0.0309741 0.0420446 0.067523 0.0075086 -0.0861516 -0.0414928 -0.1573146 -0.0641312 0.0293371 -0.0210279 0.0629171 0.0652388 0.0510789 -0.0252776 0.0928972 -0.0979294 0.013971 -0.0493301 -0.0215498 -0.0195233 -0.0617884 -0.0819913 0.042465 -0.1036148 0.0404198 0.0485446 0.013489 -0.0607669 -0.0693184 0.0352743 0.0413272 -0.0552556 0.0763751 -0.0698842 -0.0150007 0.0794194 0.0875925 0.0145648 0.0002906 -0.0575651 0.0410502 -0.0813476 -0.0031235 0.1514792 -0.0251921 -0.0025261 0.0402065 0.0825984 0.0000866 -0.0005113 -0.0023686 0.2779231 0.1107651 0.0284304 -0.0011657 0.0567773 0.0625192 0.0008838 -0.0012905 0.0005021 0.1580339 0.2414165 0.0384032 -0.0021465 0.085119 0.1673073 0.0020238 -0.0020302 0.0013099 0.3332048 unknown
polarizability: 248.6995743|-8.7178261|161.0386054|2.3797241|-0.2230553|72.6472244 unknown
InChI: InChI=1S/C9H11BrN4O/c10-8-7(5-11-14-9(8)15)13-12-6-3-1-2-4-6/h5,13-14H,1-4H2
charge 0 multiplicity 1
26 atoms
Br -1.8030 2.65217 -0.020716
O  -4.56331 1.011211 -0.067763
N  1.292425 -0.702236 0.045933
N  0.259717 0.239417 0.026812
N  -3.628534 -1.131495 -0.042715
N  -2.627411 -2.063793 -0.020502
C  4.89686 -0.275373 -0.354556
C  4.532845 1.113557 0.23993
C  3.71515 -1.182306 0.080291
C  2.992284 1.215835 0.053758
C  2.519944 -0.240133 0.067007
C  -1.060159 -0.174502 0.003229
C  -2.128142 0.733867 -0.020071
C  -1.378973 -1.594223 0.001889
C  -3.517223 0.300079 -0.04509
H  5.872723 -0.647787 0.000509
H  4.940649 -0.214999 -1.458585
H  5.072166 1.944489 -0.245456
H  4.78145 1.137295 1.317658
H  3.880914 -1.56014 1.10976
H  3.557029 -2.060853 -0.567044
H  2.744598 1.684185 -0.922645
H  2.5096 1.831737 0.838844
H  0.447844 1.25151 0.028226
H  -0.57279 -2.327214 0.019619
H  -4.579956 -1.509098 -0.059721
