program: Gaussian 09
title: 000253724
version: EM64L-G09RevD.01
frameworkgroup: C1[X(C10H13N5O4)]
method: RPBEPBE
basis: SDD
operation: Freq
keyword: #p
keyword: freq=noraman
keyword: PBEPBE/SDD
title: #p freq=noraman PBEPBE/SDD
converged: YES YES NO NO
title: Mulliken charges:
elementType: O O O O N N N N N C C C C C C C C C C H H H H H H H H H H H H H
charge: -0.265065 -0.502567 -0.465650 -0.496899 -0.204843 -0.035495 0.024295 -0.065139 -0.659420 -0.084799 -0.124903 -0.187611 -0.094489 -0.360003 0.141533 -0.198522 -0.127572 0.149091 -0.392334 0.264292 0.280525 0.269107 0.274286 0.236555 0.233926 0.385121 0.389675 0.272608 0.381937 0.394444 0.325644 0.242270
chargesum: 0.00000
title: Mulliken charges with hydrogens summed into heavy atoms:
elementType: O O O O N N N N N C C C C C C C C C C
charge: -0.265065 -0.117446 -0.075975 -0.114962 -0.204843 -0.035495 0.024295 -0.065139 0.060668 0.179493 0.155622 0.081496 0.179797 0.110477 0.141533 0.074086 -0.127572 0.149091 -0.150064
polarizability: 1.99744078e+02 -4.49867865e+00 1.65016526e+02 1.09810975e+01 3.52394245e+00 9.27893702e+01
1716.lowfreq: -13.5912 -6.1998 -0.0009 -0.0005 -0.0002 5.7815 22.6276 40.1328 62.6497
frequency: 18.2201 40.0985 62.6448 74.8664 137.3690 155.7748 166.2837 204.8677 228.8677 243.8134 264.0025 284.4441 295.0264 311.3322 323.9650 360.9518 370.3417 400.9047 429.0225 453.7278 513.4564 524.7337 554.3396 562.6252 570.6976 582.6064 592.0908 604.0576 618.4754 675.7905 690.4611 709.6605 731.4249 778.3572 789.4066 827.8112 841.6561 842.6725 892.3363 933.3633 959.6210 964.0327 977.7837 987.6790 1004.8507 1029.9892 1042.2165 1061.9761 1079.6735 1104.8421 1122.6515 1177.1666 1187.1319 1206.6452 1210.5531 1229.5887 1250.8692 1254.8096 1270.6301 1277.9863 1288.8264 1303.1193 1310.2914 1329.6245 1340.0660 1350.1133 1353.3754 1365.2515 1388.6070 1406.1766 1419.5594 1434.3601 1441.2609 1485.5060 1517.2019 1592.1043 1669.9910 2981.5812 3002.1330 3014.5117 3032.1167 3048.6962 3086.2669 3160.0749 3265.0614 3309.3319 3347.1242 3578.2738 3605.7548 3608.7107
redmass: 6.2206 7.6142 6.5127 6.0084 3.9901 5.9911 4.2539 6.1496 5.9118 5.7861 3.7649 4.7541 2.1500 5.3390 2.0349 3.1003 5.4043 1.7606 2.4260 3.7475 5.3532 4.5624 1.9895 4.2584 2.0773 5.9929 1.3547 4.6560 2.9459 8.2994 3.7197 7.0813 1.1066 6.0432 5.3048 1.6082 4.1579 3.7603 4.7610 1.4260 2.4288 6.2463 6.2246 3.2953 3.1506 4.0997 5.3526 3.3942 2.8474 3.0846 2.1411 1.1749 1.7202 1.1660 1.3191 2.4153 3.0416 1.3071 1.2883 1.4180 1.3185 5.1873 3.7650 1.9556 1.5201 1.4584 3.2392 1.7728 1.3201 1.4208 2.7549 3.1427 1.2755 1.0870 8.8028 5.6419 1.2322 1.0575 1.0845 1.0872 1.0865 1.1058 1.0907 1.0918 1.0971 1.0677 1.0618 1.0661 1.0672 1.0911
irintensity: 0.9099 3.6628 6.2108 2.1186 10.9677 0.3415 2.5884 2.0639 16.4567 5.4027 7.2397 9.8138 50.5732 7.1219 64.5494 9.1622 13.6937 63.2648 70.1144 17.4918 9.5043 20.1730 34.4311 23.2709 24.1767 1.9429 77.8316 4.5458 72.7852 5.2554 15.6622 3.0603 236.3021 13.7862 0.8891 25.1707 0.4817 20.5282 12.4417 11.7880 16.0360 77.9167 183.9277 41.2507 6.8891 37.1203 7.8074 95.3436 6.1579 11.1114 12.5416 5.7653 98.6109 28.5815 23.6716 26.1631 0.6410 22.3820 5.9375 50.6912 8.8908 28.5837 55.1328 56.7883 17.7584 4.9829 6.5417 9.1178 12.9651 4.7138 93.5225 23.7032 72.9425 7.9652 107.8508 231.2285 215.0185 36.7922 4.4355 35.9027 17.8339 20.3196 31.6788 27.5672 0.1747 275.9551 440.2273 37.7041 25.6834 98.4667
temp: 298.150 k
press: 1.00000 atm
elementType: 8 8 8 8 7 7 7 7 7 6 6 6 6 6 6 6 6 6 6 1 1 1 1 1 1 1 1 1 1 1 1 1
symmnumber: 1
zpe: 640590.2 jmol-1
zpe.correction: 0.243988 hartree
zpe.thermalcorrener: 0.260487 hartree
zpe.thermalcorrenthalpy: 0.261431 hartree
zpe.thermalcorrgfe: 0.199239 hartree
zpe.sumelectzpe: -962.063408 hartree
zpe.sumelectthermal: -962.046909 hartree
zpe.sumelectthermalent: -962.045965 hartree
zpe.sumelectthermalfe: -962.108157 hartree
dipole: 8.5730 2.3455 -0.7636
dipole: 8.9208
quadrupole: -124.1431 -111.2802 -110.4400
quadrupole: -24.4172 -6.0953 2.7253
quadrupole: -8.8553 4.0075 4.8478 -24.4172 -6.0953 2.7253
hfenergy: -962.307396 hartree
pointgroup: C01 [X(C10H13N5O4)]
dipole: 3.2727688 1.0639597 -0.689271 debye
polarizability: 201.1776667|-1.4279544|164.430445|3.0202454|-5.4335257|91.9418616 unknown
InChI: InChI=1S/C10H13N5O4/c11-8-5-9(13-2-12-8)14-3-15(5)10-7(18)6(17)4(1-16)19-10/h2-4,6-7,10,16-18H,1,11H2
charge 0 multiplicity 1
32 atoms
O  1.997185 -0.147314 1.433985
O  0.871899 2.69419 -0.405708
O  3.633237 1.501901 -1.467819
O  4.487605 -1.02002 -1.210617
N  -0.229538 -0.367123 0.580858
N  -1.287687 -2.405169 0.454464
N  -3.555436 -1.555524 -0.055393
N  -3.722674 0.890212 -0.180242
N  -1.920039 2.369252 0.052536
C  1.410159 1.33287 -0.3894
C  0.858127 0.595362 0.859387
C  2.948557 1.315052 -0.202749
C  3.182228 -0.024247 0.540488
C  3.278429 -1.252236 -0.389585
C  -1.581719 -0.094306 0.268003
C  -0.132675 -1.765714 0.686999
C  -2.219381 -1.380216 0.19649
C  -2.379367 1.072283 0.04553
C  -4.225572 -0.384307 -0.213386
H  1.13884 0.799343 -1.32135
H  0.509174 1.326629 1.610862
H  3.218207 2.152827 0.469448
H  4.064721 0.004472 1.198577
H  3.385323 -2.16926 0.219372
H  2.381809 -1.343134 -1.03509
H  1.277203 3.192028 -1.159265
H  4.147887 0.666659 -1.681906
H  0.794614 -2.243945 0.985282
H  4.722749 -1.82142 -1.737588
H  -0.922655 2.612361 -0.03392
H  -2.63092 3.083482 -0.10547
H  -5.302192 -0.458888 -0.395294
