program: Gaussian 09
title: 000253718
version: EM64L-G09RevD.01
frameworkgroup: C1[X(C18H14N4O)]
method: RPBEPBE
basis: SDD
operation: Freq
keyword: #p
keyword: freq=noraman
keyword: PBEPBE/SDD
title: #p freq=noraman PBEPBE/SDD
converged: NO YES NO NO
title: Mulliken charges:
elementType: O N N N N C C C C C C C C C C C C C C C C C C H H H H H H H H H H H H H H
charge: -0.242118 -0.147819 -0.368184 -0.102810 -0.006215 -0.347490 0.492229 0.383389 0.161363 0.055018 -0.204212 -0.417709 -0.389256 -0.367110 -0.382010 -0.010407 -0.215899 -0.231556 -0.239586 -0.248055 -0.239310 -0.238425 -0.244411 0.276534 0.257126 0.253246 0.258325 0.246489 0.251607 0.343477 0.271052 0.230199 0.230459 0.232079 0.232500 0.233579 0.233910
chargesum: 0.00000
title: Mulliken charges with hydrogens summed into heavy atoms:
elementType: O N N N N C C C C C C C C C C C C C C C C C C
charge: -0.242118 -0.147819 -0.024708 -0.102810 -0.006215 -0.070955 0.492229 0.383389 0.161363 0.055018 0.052914 -0.164463 -0.130931 -0.120621 -0.130403 -0.010407 0.055152 -0.001358 -0.009127 -0.015976 -0.006809 -0.004846 -0.010501
polarizability: 2.53306069e+02 -5.20502596e+00 2.17560703e+02 -8.64911069e+00 -1.68154441e+01 1.78439313e+02
1716.lowfreq: -11.8223 -7.1835 -1.6727 0.0007 0.0008 0.0009 7.4813 34.1173 41.8592
frequency: -7.0731 34.0776 41.8321 52.7180 73.7228 81.4103 128.0053 176.0318 177.7378 201.8200 220.7165 242.3429 260.1066 292.5436 310.6812 365.3115 403.8169 409.6442 449.7705 477.0242 516.4018 535.4164 538.8987 601.4759 612.0617 616.2165 616.9873 618.2096 639.4218 673.1892 699.6848 701.5814 708.6575 712.0374 732.7903 760.1982 771.3648 811.1285 814.0629 830.2527 855.8226 862.4213 867.4744 904.8034 912.7612 933.9719 939.2879 965.9750 981.8144 987.4140 990.9090 992.1941 999.9275 1001.5858 1025.7237 1029.3687 1035.4865 1084.2297 1088.3866 1093.8999 1160.6976 1172.4143 1175.2052 1175.3601 1186.4819 1192.9186 1197.7407 1221.2039 1250.9572 1271.2889 1315.2447 1325.0952 1339.1350 1347.2825 1368.5876 1374.9572 1382.2619 1389.3096 1408.8798 1436.8359 1445.9166 1465.4203 1483.3241 1485.1114 1504.1972 1573.8561 1590.6754 1595.3114 1612.1051 1614.0411 1616.2317 3001.7429 3123.9868 3125.5113 3127.9704 3135.0651 3138.3456 3147.3330 3149.6483 3152.2463 3154.8623 3166.4472 3168.5290 3249.7717 3585.0384
redmass: 4.8274 5.5143 6.2292 4.5024 5.3169 4.4828 7.4425 5.8056 7.5073 5.6245 5.1481 5.2115 5.0983 6.3901 6.0754 6.1083 2.8400 2.8630 4.0683 4.0127 4.7709 4.8847 7.9017 7.0871 5.6210 5.5832 6.3906 4.6345 6.0380 4.6936 3.5238 1.3114 2.1371 1.8857 2.2102 2.2064 7.6982 3.2013 1.5317 3.6615 1.2652 1.2471 3.9596 1.4442 7.3666 1.5010 1.4822 7.3766 1.4462 1.4119 6.1963 4.8232 1.3231 1.3112 2.9687 2.3510 2.8958 1.6372 1.6264 1.7022 2.6275 2.5861 1.0964 1.1576 3.1479 1.1260 1.1459 2.4126 2.6304 1.5949 3.0323 1.4581 1.7351 1.5684 1.6783 3.4618 5.0498 2.9750 2.9774 2.2295 2.1195 7.8777 2.2230 2.2436 4.9431 8.2159 6.0379 6.1483 6.0156 6.4671 9.8001 1.0831 1.0858 1.0884 1.0847 1.0876 1.0915 1.0920 1.0956 1.0921 1.0959 1.1015 1.1015 1.0993 1.0825
irintensity: 0.4180 0.1038 1.5101 0.2841 0.4818 0.3185 1.6645 1.0192 6.6432 2.5738 3.7022 4.1091 4.4872 6.6023 5.1409 1.4410 0.1606 0.0644 2.6235 1.0183 9.2043 10.1053 5.2390 3.0289 7.3572 2.2646 0.0843 25.4758 8.5179 17.1863 12.0541 107.2153 17.6228 65.4546 69.2715 39.9533 2.5564 4.1681 14.4017 14.2843 0.5320 0.2178 9.4729 11.4939 0.0492 5.4663 0.6290 61.5464 0.4788 0.1262 1.2820 1.1647 0.2550 0.0963 1.5735 8.0025 15.4044 14.1058 28.8872 16.6107 13.5713 32.8972 5.1833 9.0240 40.6902 1.8695 2.2009 11.5968 19.4213 9.0689 2.1455 3.1156 22.0242 29.9187 50.9714 26.5849 4.8029 7.4866 66.6109 14.0283 11.8540 139.8817 5.5439 27.6862 25.8263 31.6934 0.9822 2.0387 14.1274 123.4899 515.0813 9.1917 6.2764 0.9281 1.6881 0.4276 13.0056 22.7435 23.3084 16.4477 28.0517 24.7136 17.3189 2.0085 103.7239
temp: 298.150 k
press: 1.00000 atm
elementType: 8 7 7 7 7 6 6 6 6 6 6 6 6 6 6 6 6 6 6 6 6 6 6 1 1 1 1 1 1 1 1 1 1 1 1 1 1
symmnumber: 1
zpe: 745078.2 jmol-1
zpe.correction: 0.283785 hartree
zpe.thermalcorrener: 0.300661 hartree
zpe.thermalcorrenthalpy: 0.301605 hartree
zpe.thermalcorrgfe: 0.238160 hartree
zpe.sumelectzpe: -986.970980 hartree
zpe.sumelectthermal: -986.954104 hartree
zpe.sumelectthermalent: -986.953160 hartree
zpe.sumelectthermalfe: -987.016605 hartree
dipole: -3.0841 1.7751 -4.8581
dipole: 6.0219
quadrupole: -125.2149 -120.3005 -143.1300
quadrupole: 6.6994 -29.5992 4.0823
quadrupole: 4.3336 9.2480 -13.5816 6.6994 -29.5992 4.0823
hfenergy: -987.2547652 hartree
pointgroup: C01 [X(C18H14N4O1)]
dipole: 1.1536803 -0.4557428 2.0185235 debye
polarizability: 252.7908699|-9.396656|200.962294|1.7654514|26.397815|195.5529212 unknown
InChI: InChI=1S/C18H14N4O/c23-18-15-17(20-11-19-15)22(12-21-18)16(13-7-3-1-4-8-13)14-9-5-2-6-10-14/h1-12,16,19H
charge 0 multiplicity 1
37 atoms
O  -4.187323 1.27885 -2.121271
N  -0.703741 -0.035034 -0.214233
N  -3.950175 0.781252 0.939223
N  -2.012982 0.080859 1.910961
N  -1.901559 0.622429 -2.230965
C  0.584962 -0.40362 0.472648
C  1.477549 0.838628 0.599043
C  1.238202 -1.644543 -0.159075
C  -1.848979 0.212964 0.534481
C  -3.024981 0.649146 -0.101352
C  -0.818927 0.211393 -1.586481
C  1.434245 1.593093 1.797181
C  2.627277 -1.877747 0.006765
C  2.300251 1.284819 -0.466262
C  0.453846 -2.640304 -0.795597
C  -3.133071 0.889891 -1.535203
C  -3.306387 0.434337 2.117034
C  2.199753 2.773135 1.932208
C  3.220403 -3.067441 -0.46996
C  3.061367 2.46571 -0.335233
C  1.047464 -3.82752 -1.277152
C  3.014881 3.213618 0.864966
C  2.434583 -4.046449 -1.11858
H  0.260921 -0.683986 1.494303
H  0.091883 0.02273 -2.16354
H  0.789536 1.25887 2.619238
H  3.247439 -1.129623 0.511415
H  2.356958 0.706099 -1.395706
H  -0.625031 -2.49478 -0.915598
H  -4.916004 1.085824 0.815127
H  -3.792181 0.448949 3.089108
H  2.158296 3.346247 2.864905
H  4.295639 -3.228202 -0.334161
H  3.690878 2.802112 -1.166325
H  0.425496 -4.580981 -1.772715
H  3.607501 4.129583 0.965542
H  2.89521 -4.967506 -1.492034
