program: Gaussian 09
title: 000253693
version: EM64L-G09RevD.01
frameworkgroup: C1[X(C10H8N2O3)]
method: RPBEPBE
basis: SDD
operation: Freq
keyword: #p
keyword: freq=noraman
keyword: PBEPBE/SDD
title: #p freq=noraman PBEPBE/SDD
converged: YES YES NO NO
title: Mulliken charges:
elementType: O O O N N C C C C C C C C C C H H H H H H H H
charge: -0.299697 -0.237070 -0.179230 0.053564 -0.636224 0.457310 -0.189407 0.055932 0.187090 -0.055228 -0.050361 -0.293707 -0.171903 -0.349547 -0.496072 0.298959 0.238619 0.253997 0.350417 0.346265 0.230713 0.262052 0.223526
chargesum: 0.00000
title: Mulliken charges with hydrogens summed into heavy atoms:
elementType: O O O N N C C C C C C C C C C
charge: -0.299697 -0.237070 -0.179230 0.053564 0.060458 0.457310 -0.189407 0.055932 0.187090 -0.055228 -0.050361 0.005253 0.066716 -0.095550 0.220219
polarizability: 1.98647994e+02 -3.53237641e+00 1.82681994e+02 9.25774709e-01 1.06068207e+00 5.54932130e+01
1716.lowfreq: -0.0009 -0.0008 0.0005 4.5900 9.4883 11.6321 29.9068 66.0060 101.1506
frequency: 29.8747 66.0058 101.1466 122.0058 158.0897 178.5247 203.0115 267.0065 304.7031 306.9569 350.7263 372.9035 404.6207 413.1348 421.3307 436.3884 485.6881 550.3460 596.3550 602.2191 630.2536 638.2672 714.0329 718.7855 719.8194 823.6256 828.3727 874.8339 885.7699 959.9596 979.1049 1006.7691 1032.9817 1059.0596 1070.3630 1109.4971 1146.3910 1173.5629 1181.2269 1217.6742 1277.8254 1313.3166 1347.4087 1395.6885 1413.4818 1427.4716 1442.0546 1449.7981 1462.4261 1509.4074 1534.4966 1558.9868 1567.5493 1583.6263 1626.2987 3003.3016 3113.1310 3137.3995 3139.5498 3157.1126 3174.2146 3507.8158 3673.3402
redmass: 3.1224 6.0650 4.3480 2.8322 2.4964 3.0492 3.2081 4.5753 4.7028 5.5570 6.7167 8.3739 8.7450 4.7519 5.2859 4.7073 10.2659 1.7215 2.4663 5.0284 1.1290 7.6317 5.8011 4.6259 6.0530 4.4114 1.4748 7.3529 7.2112 1.4461 6.7657 1.3927 2.9371 2.8592 2.2471 1.2387 1.4397 1.7742 2.2673 3.1286 2.6642 6.6204 6.0708 3.7833 3.2758 2.1319 1.2338 1.0771 1.0621 6.2836 3.9189 7.3443 2.6823 3.2134 5.1004 1.0299 1.1032 1.0888 1.1059 1.0915 1.0996 1.0454 1.1032
irintensity: 7.8368 3.5202 8.8905 0.4014 1.5294 1.2214 0.7740 7.4127 0.9800 0.1383 2.5130 21.5051 1.2625 5.2382 6.0418 3.0413 1.5082 72.0568 149.1599 37.2768 41.3161 4.2274 8.1375 18.8472 2.1461 9.7259 37.8908 2.3262 29.4206 0.3360 100.3786 1.8000 3.9989 59.9136 10.4132 1.8075 14.6388 10.5019 84.5913 202.3223 46.3642 18.8440 30.1202 175.5958 3.5890 0.7712 46.9056 16.5390 31.9098 264.4239 271.1454 24.6170 26.0049 45.5415 402.1209 61.0808 34.1479 10.0263 15.0972 10.5029 18.0940 159.8537 65.4340
temp: 298.150 k
press: 1.00000 atm
elementType: 8 8 8 7 7 6 6 6 6 6 6 6 6 6 6 1 1 1 1 1 1 1 1
symmnumber: 1
zpe: 436380.3 jmol-1
zpe.correction: 0.166208 hartree
zpe.thermalcorrener: 0.179085 hartree
zpe.thermalcorrenthalpy: 0.180029 hartree
zpe.thermalcorrgfe: 0.126318 hartree
zpe.sumelectzpe: -719.961160 hartree
zpe.sumelectthermal: -719.948284 hartree
zpe.sumelectthermalent: -719.947340 hartree
zpe.sumelectthermalfe: -720.001051 hartree
dipole: -2.1139 -1.7192 0.5632
dipole: 2.7823
quadrupole: -66.2666 -91.4207 -87.1842
quadrupole: -14.3969 -1.7844 -1.4937
quadrupole: 15.3573 -9.7969 -5.5603 -14.3969 -1.7844 -1.4937
hfenergy: -720.1273688 hartree
pointgroup: C01 [X(C10H8N2O3)]
dipole: -0.7806275 -0.6705909 0.3731012 debye
dipolederiv: -1.5647516 -0.7278231 0.2421809 -0.504351 -0.5170732 0.0925196 0.0273846 0.015075 -0.31188 -0.5934073 -0.0968789 0.026579 -0.0189713 -1.2004411 0.1055388 0.009179 0.0975163 -0.3247041 -0.5077481 -0.0502889 0.0189687 -0.1626618 -1.1304603 0.1455747 0.0190991 0.1211784 -0.3170388 -0.2731682 -0.0821063 0.0076124 -0.0100733 -0.1871656 -0.0042895 -0.0067373 -0.0054498 -0.2177179 -0.7473741 0.8839658 -0.1397268 0.5475726 -0.9528611 0.0453455 -0.0905138 0.0339968 -0.6133509 -0.3621847 -0.2301382 0.0483586 0.0239192 -0.0834497 0.0205004 0.0029929 0.0529432 0.0689442 -0.0943293 0.3263968 -0.0387122 0.0376784 -0.0669621 0.0189911 -0.0053046 0.0075539 0.0457753 1.0853717 0.9867692 -0.2278222 1.0068773 -0.7069671 0.1125766 -0.104493 0.1199941 -0.0108329 -0.2309009 -1.1485525 0.2217481 -1.2682325 0.7695204 -0.0734694 0.2606651 -0.0437415 0.0906791 0.879499 -0.3898862 0.0459167 -0.1204526 1.3917154 -0.1506716 -0.0398111 -0.1761482 0.1448271 1.1404959 0.4512079 -0.1127003 0.1504454 1.258283 -0.1858225 -0.0322739 -0.1722516 0.1799216 0.0751658 0.1341403 -0.0255932 -0.0074787 0.1074198 -0.0289861 -0.0011387 -0.0334324 -0.0883847 -0.1428738 -0.1698167 0.0288897 -0.3426974 -0.0228797 -0.0017313 0.0475806 -0.0091261 -0.1019102 0.2974444 0.0853401 -0.0149987 0.362753 0.1180544 -0.0377227 -0.0538424 -0.0273842 -0.0531882 0.5808548 0.2348361 -0.1001273 0.4709941 0.5250427 -0.1289969 -0.1618268 -0.1019198 0.3450851 0.1372856 -0.0825956 0.0116408 -0.0043596 0.0345319 0.0175696 0.0035275 0.0170667 0.1464401 -0.030736 0.0930053 -0.009496 0.1085008 0.0237779 0.0172093 -0.0121191 0.0179835 0.1537825 -0.1142328 -0.0281229 0.0084252 -0.0492061 0.0840846 0.0084655 0.0127742 0.0090368 0.1368393 0.2288833 -0.0718666 0.0156308 -0.0493534 0.3450843 0.0035526 0.0144198 0.0000718 0.3644868 0.2876722 -0.1301197 0.0233344 -0.027024 0.16584 0.0275425 0.0113032 0.0390617 0.3713571 0.0391553 -0.0067222 -0.0994449 -0.1141153 0.0098116 0.0272527 0.017609 0.0553232 -0.1229921 0.1106106 0.0631768 0.0358619 -0.0828921 -0.0463918 -0.0451217 0.058208 -0.0450441 0.0079923 -0.2007318 -0.0439205 0.0334745 0.0531284 0.0814858 0.0141729 0.0233174 0.0276962 0.1058691 unknown
polarizability: 198.7946779|-3.4178786|179.2380949|-5.0177029|-19.5767871|58.7904283 unknown
InChI: InChI=1S/C10H8N2O3/c1-15-10-6(11)9(14)7-5(8(10)13)3-2-4-12-7/h2-4H,11H2,1H3
charge 0 multiplicity 1
23 atoms
O  -3.024889 -0.291125 0.175137
O  -0.872529 -2.334002 0.362552
O  0.31427 3.001307 -0.403143
N  2.471894 1.167465 -0.155566
N  -2.277898 2.250708 -0.232198
C  0.81677 -0.625775 0.135578
C  1.179111 0.736449 -0.071449
C  -1.646332 -0.056594 0.12808
C  -1.316389 1.287316 -0.098335
C  -0.616894 -1.084362 0.221325
C  0.094507 1.766577 -0.211108
C  1.851975 -1.580715 0.253685
C  3.192961 -1.148948 0.1678
C  3.453823 0.228021 -0.034144
C  -3.571718 -1.535806 0.762217
H  1.581877 -2.629774 0.407124
H  4.022353 -1.857514 0.253567
H  4.481289 0.601963 -0.103964
H  -1.971185 3.211917 -0.392254
H  -3.261518 1.997177 -0.173044
H  -3.183218 -1.687486 1.784041
H  -3.313899 -2.407442 0.143547
H  -4.659262 -1.365258 0.783251
