program: Gaussian 09
title: 000253719
version: EM64L-G09RevD.01
frameworkgroup: C1[X(C19H16N4O)]
method: RPBEPBE
basis: SDD
operation: Freq
keyword: #p
keyword: freq=noraman
keyword: PBEPBE/SDD
title: #p freq=noraman PBEPBE/SDD
converged: YES YES NO NO
title: Mulliken charges:
elementType: O N N N N C C C C C C C C C C C C C C C C C C C H H H H H H H H H H H H H H H H
charge: -0.275149 -0.138635 -0.087181 -0.107750 0.002295 0.096594 0.135583 -0.596250 -0.589120 -0.207416 0.490075 0.026690 0.509279 -0.233617 -0.398876 -0.376523 -0.367282 -0.406358 -0.228178 -0.229144 -0.229133 -0.225146 -0.232345 -0.232402 0.282401 0.225275 0.228890 0.261821 0.264964 0.238394 0.221540 0.296388 0.273461 0.227075 0.226607 0.231724 0.229027 0.229473 0.230536 0.232411
chargesum: 0.00000
title: Mulliken charges with hydrogens summed into heavy atoms:
elementType: O N N N N C C C C C C C C C C C C C C C C C C C
charge: -0.275149 -0.138635 -0.087181 -0.107750 0.002295 0.096594 0.135583 -0.088574 -0.098408 0.057548 0.490075 0.026690 0.509279 0.004777 -0.177336 -0.080134 -0.093821 -0.179283 -0.001570 0.002580 -0.000106 0.004326 -0.001809 0.000009
polarizability: 3.02183013e+02 5.89541867e+00 2.27479651e+02 1.19575800e+01 -8.69176055e+00 1.49158100e+02
1716.lowfreq: -1.3757 0.0005 0.0006 0.0008 1.4023 6.8398 16.4386 23.8915 28.5020
frequency: 16.2611 23.8611 28.4877 37.5604 44.3713 61.8518 103.7036 116.9019 164.2064 186.6836 191.6494 211.7563 243.4373 287.6451 328.9801 352.4331 358.3207 378.7910 404.1865 405.1853 439.0217 456.0770 501.5186 517.1299 533.5277 570.8428 582.1826 615.2150 617.1954 618.2854 635.8286 650.7711 675.6656 704.7718 707.6095 720.3392 748.0148 769.3540 781.6335 794.9189 805.2179 816.1527 824.8262 859.0831 862.2042 898.7586 923.2141 936.3278 941.2245 947.4306 964.1358 984.1591 986.3674 987.5519 989.7805 989.9741 1002.8435 1010.3680 1027.1419 1027.2030 1082.8699 1086.8030 1128.3832 1167.8986 1173.9364 1174.5987 1176.7078 1179.5308 1190.4490 1192.3552 1210.8782 1212.2709 1260.5847 1290.0717 1314.5422 1329.6510 1335.2114 1353.3914 1357.1982 1367.9820 1370.5863 1384.4038 1388.9285 1422.4761 1443.5607 1444.8291 1450.3721 1464.8866 1465.1531 1484.3470 1484.8311 1497.6821 1566.4252 1593.9619 1595.4405 1601.3343 1613.8417 1614.2547 3025.4321 3026.9621 3088.0721 3095.7608 3109.8294 3114.9924 3124.9463 3126.1220 3128.0401 3133.6887 3137.1426 3147.1965 3148.6932 3163.4697 3165.3876 3240.9551
redmass: 4.7248 5.6450 4.9552 4.1247 5.8841 5.2460 7.7662 6.1816 4.8730 5.1317 6.0859 5.8855 5.5673 7.0503 2.9587 2.1492 6.0011 3.0349 2.8191 2.8489 4.4355 3.8904 5.0424 3.9636 6.0535 5.4624 4.6490 5.9098 6.2295 5.5465 5.1918 4.3287 9.9472 2.9397 1.8333 1.8066 2.6790 6.7490 3.0298 4.3460 1.8327 3.3428 2.6839 1.2468 1.2550 1.4578 1.8560 1.5409 1.7011 1.7405 7.1690 1.4222 4.3041 1.3723 5.8193 5.4744 1.3311 1.3213 2.2562 2.2400 1.6991 1.5897 2.6700 1.8698 1.1071 1.0793 1.4981 2.8937 1.1321 1.1364 2.8827 2.9724 2.7437 2.4650 2.8466 1.4389 1.3054 1.5516 1.4848 1.4320 2.4900 7.7630 3.8938 2.4635 2.2522 2.1516 4.4026 1.4877 1.1701 2.2154 2.2932 4.6675 7.5081 6.6145 6.0665 8.6106 6.0207 5.9409 1.0599 1.0607 1.1049 1.1043 1.0883 1.0882 1.0876 1.0868 1.0916 1.0916 1.0915 1.0958 1.0961 1.1014 1.1015 1.0987
irintensity: 0.1141 0.3113 0.0209 0.1500 0.7948 1.1625 5.1446 2.6490 4.8595 0.7461 1.0496 1.1985 2.8358 0.8373 8.4421 1.1253 1.8874 1.3826 0.1718 0.1196 0.2834 1.0485 20.5539 0.5311 4.5927 1.5885 7.8729 3.2504 0.1176 4.9924 24.3521 9.5774 0.0203 25.1540 22.7315 138.5242 67.4728 2.5815 3.0306 3.8979 23.8382 7.8104 4.3021 0.3909 0.9336 13.3004 0.0753 7.9383 9.3752 3.3159 43.7034 0.7552 34.3166 0.7358 3.4419 0.3534 1.0360 2.9958 3.9796 10.9719 2.8956 30.8288 2.5523 27.3406 2.7330 5.3719 24.3876 74.7432 0.8846 0.7307 27.1245 2.9244 1.5573 62.4832 5.4730 13.1873 4.3544 35.1822 14.0431 17.5415 28.6082 1.6148 20.4664 63.1614 19.9294 11.4634 115.9137 33.0453 32.6457 8.5201 33.6411 50.9675 21.9982 123.1478 1.2025 483.1882 4.2388 1.6970 28.8667 25.8032 1.6036 0.8617 11.7435 9.8445 5.5441 1.0307 16.4127 6.9347 7.2239 22.9443 25.7757 36.5558 27.3086 1.6125
temp: 298.150 k
press: 1.00000 atm
elementType: 8 7 7 7 7 6 6 6 6 6 6 6 6 6 6 6 6 6 6 6 6 6 6 6 1 1 1 1 1 1 1 1 1 1 1 1 1 1 1 1
symmnumber: 1
zpe: 818362.1 jmol-1
zpe.correction: 0.311698 hartree
zpe.thermalcorrener: 0.330854 hartree
zpe.thermalcorrenthalpy: 0.331799 hartree
zpe.thermalcorrgfe: 0.260681 hartree
zpe.sumelectzpe: -1026.195498 hartree
zpe.sumelectthermal: -1026.176341 hartree
zpe.sumelectthermalent: -1026.175397 hartree
zpe.sumelectthermalfe: -1026.246515 hartree
dipole: 1.7675 -4.5216 -2.0129
dipole: 5.2555
quadrupole: -114.8705 -143.8292 -139.1044
quadrupole: 13.3148 4.5008 -15.5626
quadrupole: 17.7309 -11.2279 -6.5030 13.3148 4.5008 -15.5626
hfenergy: -1026.5071956 hartree
pointgroup: C01[X(C19H16N4O1)]
dipole: -0.7210255 -1.783947 0.756929 debye
polarizability: 301.9956019|-7.2074721|227.2998043|11.9538151|10.0552658|149.5253587 unknown
InChI: InChI=1S/C19H16N4O/c24-19-17-18(20-13-22(17)11-15-7-3-1-4-8-15)23(14-21-19)12-16-9-5-2-6-10-16/h1-10,13-14H,11-12H2
charge 0 multiplicity 1
40 atoms
O  1.582386 2.318616 -1.472073
N  1.301656 -0.717038 -0.743807
N  -1.525962 0.740918 0.834828
N  -0.458053 -1.486991 0.503124
N  -0.40066 2.624996 -0.209805
C  0.523087 0.406891 -0.423192
C  -0.544445 -0.110654 0.339965
C  2.587992 -0.709093 -1.498333
C  -2.688091 0.218981 1.615502
C  0.680317 -1.811784 -0.165071
C  3.80809 -0.560945 -0.594775
C  0.649679 1.820349 -0.764284
C  -3.887007 -0.143259 0.745981
C  -1.375283 2.088458 0.510185
C  4.527551 -1.701485 -0.159615
C  4.230015 0.729081 -0.182499
C  -3.911965 -1.372088 0.037149
C  -4.987505 0.742513 0.636834
C  5.650238 -1.560041 0.687279
C  5.351386 0.869362 0.664816
C  -5.019101 -1.701031 -0.775318
C  -6.096127 0.412868 -0.175534
C  6.062488 -0.272761 1.103085
C  -6.112926 -0.80991 -0.884748
H  2.526377 0.136381 -2.202662
H  2.632441 -1.65378 -2.068542
H  -2.958508 0.998716 2.349274
H  -2.318866 -0.664681 2.163147
H  1.073908 -2.82184 -0.248661
H  -2.156321 2.746143 0.910725
H  4.215835 -2.70202 -0.487436
H  3.678487 1.60938 -0.534595
H  -3.060025 -2.056781 0.124181
H  -4.982102 1.690398 1.190213
H  6.203343 -2.44676 1.016744
H  5.673162 1.868641 0.978464
H  -5.031602 -2.651703 -1.319948
H  -6.942708 1.103986 -0.252665
H  6.933877 -0.160676 1.758097
H  -6.971658 -1.067656 -1.514627
