program: Gaussian 09
title: 000253670
version: EM64L-G09RevD.01
frameworkgroup: C1[X(C9H12ClN5O2)]
method: RPBEPBE
basis: SDD
operation: Freq
keyword: #p
keyword: freq=noraman
keyword: PBEPBE/SDD
title: #p freq=noraman PBEPBE/SDD
converged: YES YES NO NO
title: Mulliken charges:
elementType: Cl O O N N N N N C C C C C C C C C H H H H H H H H H H H H
charge: -0.024025 -0.251701 -0.290681 -0.087664 -0.382770 -0.424024 -0.086692 0.051410 0.240697 0.315840 -0.620265 -0.279442 0.245298 0.255018 -0.360609 -0.764214 -0.770781 0.281517 0.274289 0.231045 0.377777 0.321677 0.256299 0.257964 0.248453 0.233238 0.267509 0.257440 0.227395
chargesum: 0.00000
title: Mulliken charges with hydrogens summed into heavy atoms:
elementType: Cl O O N N N N N C C C C C C C C C
charge: -0.024025 -0.251701 -0.290681 -0.087664 -0.004992 -0.102347 -0.086692 0.051410 0.240697 0.315840 0.166587 -0.279442 0.245298 0.255018 -0.104310 -0.024559 -0.018436
polarizability: 1.93322933e+02 -3.09516593e+00 1.73325814e+02 -4.13703305e+00 -4.64578579e+00 9.56802646e+01
1716.lowfreq: -3.9218 -0.0016 -0.0010 0.0013 3.5520 10.2656 22.3052 46.5330 55.7639
frequency: 21.5175 46.4821 55.7296 61.9794 84.7734 89.1008 98.0393 113.7652 127.2854 149.0736 176.0882 185.0295 223.0457 255.3509 280.2842 308.2972 329.8716 348.4442 362.8074 393.8953 428.0990 503.0504 505.1972 541.4122 555.8678 569.7822 595.8785 606.5085 617.9652 666.6371 721.5673 744.6357 753.6606 787.0638 836.7885 924.0988 929.5212 937.2277 980.4130 994.5090 1011.1330 1037.5006 1042.2121 1115.6332 1127.2365 1147.3000 1176.9513 1207.1309 1252.6447 1288.7637 1301.1602 1347.7266 1370.7334 1389.4607 1390.5282 1399.6437 1429.9350 1442.3386 1454.8859 1465.4260 1469.7909 1471.3221 1477.2258 1481.0563 1508.2374 1528.6791 1539.8201 1611.4560 1632.9440 2996.9856 2997.8751 2998.3138 3088.5850 3091.1662 3094.1172 3109.5012 3119.8415 3153.6314 3173.8181 3278.9815 3502.2334
redmass: 5.8115 4.0581 1.4174 3.3087 3.0797 4.0573 3.5666 1.2570 1.1948 2.8223 11.0684 7.0128 5.6206 5.6881 5.1318 3.9680 4.8026 6.3584 3.6573 6.9531 4.2790 4.4860 3.8847 3.9568 4.0915 2.0635 2.4858 9.8768 3.0841 4.6187 4.7306 2.5533 2.1504 4.7239 7.3687 3.6711 4.7712 1.5425 2.3383 1.7146 2.1544 1.6536 1.6594 3.8446 1.3128 3.2519 3.3833 4.8204 3.2057 4.0177 5.5917 5.9294 1.5288 1.2170 1.2220 1.3801 2.4363 1.1168 1.0585 1.1343 1.2109 1.1228 1.6374 1.0622 2.2276 2.6151 5.4245 4.7614 5.9392 1.0366 1.0373 1.0358 1.0981 1.1005 1.0983 1.1010 1.0998 1.0992 1.0930 1.0859 1.0763
irintensity: 2.0622 6.4644 0.7123 0.1910 3.8602 6.6908 6.7251 2.1957 0.9052 12.5675 1.2392 7.5014 3.2477 1.2588 1.9759 0.7576 6.0755 1.4881 1.1296 12.7565 2.4311 3.3324 3.1189 9.8113 21.7604 21.7700 39.4876 0.5405 35.1097 3.0190 17.0098 56.5959 126.4150 1.4721 39.2404 31.5956 9.6451 6.5828 75.7127 7.7191 36.8391 22.1175 6.5582 13.9831 3.7328 3.1579 26.9453 27.4374 14.6200 95.1605 177.8256 136.7107 76.6911 24.6888 93.3169 33.6306 44.7663 65.3106 16.1914 61.9732 44.5008 9.5394 189.4247 33.3385 157.1165 80.5321 487.2496 142.5169 169.1561 48.5877 3.3434 6.8678 8.9629 9.8149 9.4969 12.0487 8.7178 0.7351 16.3092 232.8329 29.3177
temp: 298.150 k
press: 1.00000 atm
elementType: 17 8 8 7 7 7 7 7 6 6 6 6 6 6 6 6 6 1 1 1 1 1 1 1 1 1 1 1 1
symmnumber: 1
zpe: 566041.0 jmol-1
zpe.correction: 0.215594 hartree
zpe.thermalcorrener: 0.233433 hartree
zpe.thermalcorrenthalpy: 0.234378 hartree
zpe.thermalcorrgfe: 0.168004 hartree
zpe.sumelectzpe: -1233.143440 hartree
zpe.sumelectthermal: -1233.125601 hartree
zpe.sumelectthermalent: -1233.124656 hartree
zpe.sumelectthermalfe: -1233.191030 hartree
dipole: -1.7041 2.8152 0.0919
dipole: 3.2920
quadrupole: -117.9586 -92.7109 -114.6156
quadrupole: -3.2207 -8.3587 -8.7860
quadrupole: -9.5302 15.7175 -6.1873 -3.2207 -8.3587 -8.7860
hfenergy: -1233.359034 hartree
pointgroup: C01 [X(C9H12Cl1N5O2)]
dipole: -0.3997632 -1.1730593 0.3763556 debye
polarizability: 187.5308432|14.0238884|162.9040187|14.353832|-28.597404|111.8941497 unknown
InChI: InChI=1S/C9H12ClN5O2/c1-5(16)13-7-8(10)11-4-12-9(7)15(3)14-6(2)17/h4,13-14H,1-3H3
charge 0 multiplicity 1
29 atoms
Cl 3.549298 -0.198405 1.113895
O  -3.352622 0.230616 1.011699
O  0.17266 -2.441509 -0.834135
N  -1.304577 0.745555 -0.843592
N  -1.810208 -0.534999 -0.568131
N  0.681433 -0.95236 0.894312
N  0.444534 2.245364 -1.162505
N  2.703046 1.906067 -0.363323
C  0.021697 1.048896 -0.610648
C  0.966785 0.235012 0.136209
C  -2.232933 1.661872 -1.543089
C  2.283804 0.754624 0.181185
C  -2.829776 -0.722549 0.36522
C  0.497442 -2.232938 0.379203
C  1.729371 2.614511 -1.012199
C  -3.284443 -2.172688 0.489495
C  0.70348 -3.366631 1.37069
H  -1.749665 2.642692 -1.634256
H  -3.15563 1.738261 -0.945091
H  -2.463086 1.267955 -2.549632
H  -1.293003 -1.322815 -1.000554
H  0.942693 -0.899112 1.883445
H  2.028664 3.570913 -1.449449
H  -4.304707 -2.26831 0.077419
H  -3.337141 -2.43794 1.558735
H  -2.624889 -2.883291 -0.037188
H  1.706356 -3.802464 1.20826
H  -0.037279 -4.159668 1.183406
H  0.635295 -3.042758 2.423418
