program: Gaussian 09
title: 000253424
version: EM64L-G09RevD.01
frameworkgroup: C1[X(C12H17Cl2N3O4)]
method: RPBEPBE
basis: SDD
operation: Freq
keyword: #p
keyword: freq=noraman
keyword: PBEPBE/SDD
title: #p freq=noraman PBEPBE/SDD
converged: YES YES NO NO
title: Mulliken charges:
elementType: Cl Cl O O O O N N N C C C C C C C C C C C C H H H H H H H H H H H H H H H H H
charge: -0.055937 -0.055117 -0.252752 -0.266051 -0.411797 -0.230066 -0.188444 -0.148899 -0.396125 0.270224 -0.380303 -0.361310 -0.226548 -0.381673 -0.313398 0.111083 0.174674 -0.479388 -0.582063 -0.633401 0.180565 0.263079 0.215371 0.234505 0.248277 0.267076 0.314115 0.258045 0.236925 0.225865 0.269763 0.246619 0.365047 0.264097 0.273312 0.276511 0.286619 0.381500
chargesum: 0.00000
title: Mulliken charges with hydrogens summed into heavy atoms:
elementType: Cl Cl O O O O N N N C C C C C C C C C C C C
charge: -0.055937 -0.055117 -0.252752 -0.266051 -0.030297 -0.230066 -0.188444 -0.148899 -0.031079 0.270224 0.098147 0.121472 0.040529 0.190486 0.149392 0.111083 0.174674 0.036994 -0.044654 -0.070271 0.180565
polarizability: 2.65280106e+02 -1.04148306e+01 1.76548069e+02 1.34994801e+01 3.65102195e+00 1.30493658e+02
1716.lowfreq: -0.0032 -0.0030 -0.0015 1.7235 3.0674 7.7936 12.7442 19.3744 20.7301
frequency: 12.6302 19.3729 20.6623 36.9281 41.4037 53.2134 64.5390 80.8456 87.6866 95.2887 98.7599 121.7418 136.9362 158.8254 180.8175 210.8593 226.0463 243.4412 285.2407 305.9696 329.1020 345.3501 364.4970 383.9482 394.6276 413.8774 457.4757 474.2346 503.6701 534.3399 556.4991 588.9248 611.1423 636.4654 647.8348 667.3760 689.0924 701.9529 726.4527 741.1921 753.0514 779.4942 783.4409 808.1324 820.4095 852.1757 869.9289 889.5270 934.3100 981.2412 1025.0893 1032.2823 1035.0580 1054.5825 1063.5802 1075.5727 1087.2250 1123.2336 1137.0607 1153.8761 1169.6086 1193.1383 1206.8949 1241.7399 1249.4637 1260.9241 1264.9663 1272.3441 1282.8606 1297.8352 1299.5248 1316.6253 1350.8958 1352.9198 1358.7053 1370.2940 1374.0785 1380.2544 1389.9005 1428.9768 1442.9797 1443.5761 1450.8624 1460.2731 1467.3559 1480.6646 1491.2511 1605.4777 1618.4776 1654.9948 1667.4007 2904.4715 2982.7326 2983.3095 2999.9266 3011.9100 3046.6578 3048.9846 3057.6958 3064.8912 3068.9234 3090.4445 3111.1786 3140.8747 3147.5924 3176.0831 3513.7337 3522.8925
redmass: 10.1003 10.0973 11.1824 11.9515 7.3975 10.0987 5.7387 3.2283 2.5935 3.4641 3.0371 3.5152 5.7484 6.5987 6.8771 5.5428 6.1409 3.5315 4.6568 3.0374 3.3891 3.6763 5.3129 4.8036 4.3512 5.1010 5.4097 4.2458 2.1579 3.1606 5.3397 3.9288 5.6009 4.0800 1.4033 5.1198 3.2676 5.0045 3.6708 2.5839 1.7043 1.5071 1.5998 3.2933 1.4080 1.5564 3.6611 2.3189 2.3403 1.6588 2.9978 1.6186 3.9514 2.7379 2.8763 2.4182 2.5684 1.8246 1.7196 2.1349 1.6768 1.8307 3.0122 1.3915 1.5432 1.5511 1.2054 1.3919 1.2879 1.3716 1.2153 1.6576 1.4215 1.5077 1.5201 1.7739 1.5284 1.6623 1.7012 4.1237 1.0858 1.0943 1.0938 1.0956 1.0802 1.0915 1.0905 5.3199 8.1062 6.1964 8.3620 1.0671 1.0651 1.0908 1.0634 1.0614 1.0590 1.0944 1.0571 1.0580 1.0992 1.1031 1.1057 1.1114 1.1107 1.0918 1.0640 1.0768
irintensity: 1.2073 0.1308 0.5768 1.2845 2.8258 0.0907 0.7754 0.2458 1.4153 2.9721 0.7529 1.1841 0.2075 5.3421 1.1398 6.8776 4.1518 2.1192 8.0254 3.3025 3.6719 9.9619 6.1439 17.8240 7.2550 33.8461 30.9500 17.3379 29.5961 5.1461 9.8779 16.5505 13.8195 10.6587 121.6103 31.1188 13.2913 19.2854 18.6582 10.0559 17.9985 47.3935 70.8559 5.4093 55.4882 3.0203 5.7848 4.7156 33.3654 5.4225 154.6903 43.0053 1.2269 67.9464 24.6099 10.6194 69.7194 40.1333 12.4456 47.5842 1.6514 69.2838 9.5467 1.3729 69.9531 42.5230 5.1863 10.4420 66.7579 12.2202 11.2876 145.2358 31.8056 42.5143 91.9618 7.6075 4.9032 15.7974 73.3529 23.7066 21.1933 11.6963 9.9434 43.9249 21.6305 24.5524 62.8514 209.3395 287.3663 551.3846 201.9782 48.7925 10.0720 15.7113 20.7895 31.5404 7.5882 1.6985 33.8903 15.7764 8.3548 14.4160 7.1294 7.7424 6.1672 12.5315 27.0452 65.0639
temp: 298.150 k
press: 1.00000 atm
elementType: 17 17 8 8 8 8 7 7 7 6 6 6 6 6 6 6 6 6 6 6 6 1 1 1 1 1 1 1 1 1 1 1 1 1 1 1 1 1
symmnumber: 1
zpe: 766962.4 jmol-1
zpe.correction: 0.292121 hartree
zpe.thermalcorrener: 0.314546 hartree
zpe.thermalcorrenthalpy: 0.315490 hartree
zpe.thermalcorrgfe: 0.234839 hartree
zpe.sumelectzpe: -1851.168259 hartree
zpe.sumelectthermal: -1851.145834 hartree
zpe.sumelectthermalent: -1851.144890 hartree
zpe.sumelectthermalfe: -1851.225541 hartree
dipole: 5.3347 4.0585 2.0060
dipole: 6.9967
quadrupole: -155.9583 -149.5114 -139.4434
quadrupole: 6.1924 7.6985 -1.8912
quadrupole: -7.6540 -1.2070 8.8609 6.1924 7.6985 -1.8912
hfenergy: -1851.46038 hartree
pointgroup: C01 [X(C12H17Cl2N3O4)]
dipole: 2.3084423 1.3445965 0.6638047 debye
polarizability: 261.6053774|-20.9610973|180.9042901|11.9460526|-0.408638|129.8121667 unknown
InChI: InChI=1S/C12H17Cl2N3O4/c13-3-6-16(7-4-14)9-8-17(5-1-2-10(18)19)12(21)15-11(9)20/h8,15,18H,1-7H2
charge 0 multiplicity 1
38 atoms
Cl -5.886183 0.188541 1.635674
Cl -3.897709 3.939857 0.002984
O  -2.672611 -1.98814 -1.326271
O  1.48236 -3.384119 0.260113
O  6.694694 0.966561 0.579468
O  5.020921 1.701537 -0.852401
N  -2.25185 0.742829 -0.328027
N  0.839329 -1.153171 0.67119
N  -0.626403 -2.620434 -0.430285
C  -1.344847 -0.318886 -0.100381
C  2.150914 -0.850673 1.293868
C  3.116932 -0.154799 0.311685
C  -0.128885 -0.148529 0.549557
C  -3.703836 0.514696 -0.089185
C  -1.708011 2.114228 -0.239386
C  -1.640664 -1.658002 -0.67065
C  0.631056 -2.453728 0.176896
C  4.478837 0.119951 0.977825
C  -4.044966 0.552346 1.411702
C  -2.502995 3.163936 -1.021054
C  5.370522 1.001953 0.122872
H  2.571969 -1.814532 1.626784
H  1.973465 -0.218599 2.185106
H  2.685794 0.797021 -0.04973
H  3.258053 -0.797996 -0.575596
H  0.143903 0.799964 1.016607
H  -3.972094 -0.461743 -0.520531
H  -4.286405 1.287659 -0.614548
H  -0.696951 2.077992 -0.696421
H  -1.570668 2.476884 0.806029
H  5.021035 -0.815772 1.204707
H  4.346871 0.638816 1.950068
H  -0.805302 -3.55422 -0.814223
H  -3.519029 -0.230199 1.979799
H  -3.889856 1.544876 1.860351
H  -1.861175 4.018036 -1.281878
H  -2.975865 2.746916 -1.922147
H  7.254946 1.569544 0.01863
