program: Gaussian 09
title: 000253420
version: EM64L-G09RevD.01
frameworkgroup: C1[X(C9H19Cl2N2O2P)]
method: RPBEPBE
basis: SDD
operation: Freq
keyword: #p
keyword: freq=noraman
keyword: PBEPBE/SDD
title: #p freq=noraman PBEPBE/SDD
converged: YES YES NO NO
title: Mulliken charges:
elementType: Cl Cl P O O N N C C C C C C C C C H H H H H H H H H H H H H H H H H H H
charge: -0.059380 -0.061331 1.319952 -0.669508 -0.607094 -0.514970 -0.526718 -0.343676 -0.326239 -0.373294 -0.374228 -0.400198 -0.275654 -0.310290 -0.576776 -0.566731 0.226028 0.232189 0.206620 0.258702 0.200312 0.206848 0.203520 0.209406 0.194729 0.223630 0.235029 0.271753 0.230599 0.278617 0.386785 0.286042 0.264170 0.292914 0.258243
chargesum: 0.00000
title: Mulliken charges with hydrogens summed into heavy atoms:
elementType: Cl Cl P O O N N C C C C C C C C C
charge: -0.059380 -0.061331 1.319952 -0.282723 -0.607094 -0.514970 -0.526718 0.114541 0.139084 0.033865 0.038698 0.018161 0.231128 0.198926 -0.026564 -0.015575
polarizability: 1.88687080e+02 6.04514995e+00 1.56862395e+02 6.23468129e+00 1.52212037e+00 1.29105565e+02
1716.lowfreq: -17.6321 -8.7267 -0.0035 -0.0032 -0.0028 4.8909 17.0320 23.6146 35.2082
frequency: 16.9544 20.1500 35.1028 48.3576 69.0484 72.8000 96.3727 102.2043 129.5872 177.7515 189.7530 203.0605 211.9694 217.6631 227.5900 241.6898 269.2773 287.1017 307.0991 342.1713 362.4823 374.3567 409.6489 434.7722 439.3637 482.7322 519.4107 614.2113 669.8197 688.9253 690.7179 721.7901 771.0023 776.9532 802.7545 831.4425 852.2020 905.6596 927.8273 952.1213 958.0270 976.4623 1002.1485 1019.1964 1038.7170 1046.3511 1050.3752 1063.7209 1065.5414 1078.5723 1118.9275 1120.3048 1150.2718 1152.7365 1205.8141 1212.5784 1232.7884 1254.5528 1258.7712 1259.5168 1271.6937 1294.5757 1306.9930 1331.0498 1334.5089 1339.8630 1348.8083 1349.7127 1357.8973 1367.7222 1368.7681 1444.1318 1448.3771 1452.2472 1457.7212 1460.6002 1464.7928 1469.6362 1470.9085 1481.8902 2926.9876 2931.7537 2971.8695 2981.5541 2990.2766 2998.0606 3022.8182 3038.9851 3040.5914 3047.4041 3055.8831 3057.5435 3066.3576 3079.1744 3091.1658 3095.1014 3146.0777 3156.9973 3596.9004
redmass: 5.9923 4.2149 13.5363 4.4494 6.4270 4.7518 2.2774 2.4259 4.8473 3.1536 6.1029 3.1839 5.3294 4.2012 3.4380 3.7899 2.5925 2.0853 2.3598 2.0417 6.1658 1.8973 5.5448 3.0010 3.7621 3.8855 2.5027 3.8800 5.8422 7.3384 5.3529 4.4833 1.1866 1.1939 1.4777 2.6954 1.5128 2.4424 3.4362 1.3204 2.7398 1.9521 1.4808 2.2243 2.4820 2.3576 2.6705 2.4381 1.9734 1.5564 3.0225 1.6552 2.3178 1.2070 2.3144 1.9196 1.5768 1.1717 1.2468 1.1692 1.1580 1.1519 1.3865 1.2703 1.2067 1.3846 1.3919 1.4224 1.2174 1.2976 1.2893 1.0872 1.0867 1.0928 1.0890 1.0876 1.0867 1.0796 1.0748 1.0866 1.0702 1.0679 1.0637 1.0609 1.0609 1.0646 1.0612 1.0944 1.0950 1.1026 1.0562 1.1033 1.0599 1.0965 1.1038 1.0919 1.1126 1.1107 1.0659
irintensity: 0.1181 0.2725 0.4819 0.9586 2.2338 1.5813 3.0529 1.1490 1.0528 0.9426 7.3595 2.5178 4.4272 0.5403 11.4419 37.0131 1.7438 36.4555 45.0052 42.7306 4.2223 10.9028 15.9489 9.9214 43.4611 11.7297 27.9134 10.5859 6.1594 124.5674 106.8953 191.7941 2.1150 22.2739 0.1962 10.6915 9.5794 0.7112 163.6445 5.8383 93.4850 32.1188 0.3643 4.6451 8.6041 33.5426 24.7847 67.3676 26.4898 44.3193 21.8423 42.8935 23.6743 3.4589 74.8122 30.3831 7.8438 12.4303 1.7482 8.6303 12.3414 6.2165 3.5995 1.1918 11.3207 0.3696 0.3122 0.9988 1.4671 3.8091 0.4951 7.0231 4.0826 5.9529 23.1851 17.6456 17.0894 4.3168 14.3576 10.1265 54.1579 55.8682 37.0762 29.4396 30.9608 20.5687 11.6299 50.5378 40.0623 20.8056 15.7065 85.4238 17.6517 3.8011 1.6336 6.6342 8.9513 10.5180 59.8253
temp: 298.150 k
press: 1.00000 atm
elementType: 17 17 15 8 8 7 7 6 6 6 6 6 6 6 6 6 1 1 1 1 1 1 1 1 1 1 1 1 1 1 1 1 1 1 1
symmnumber: 1
zpe: 746928.4 jmol-1
zpe.correction: 0.284490 hartree
zpe.thermalcorrener: 0.303859 hartree
zpe.thermalcorrenthalpy: 0.304803 hartree
zpe.thermalcorrgfe: 0.233486 hartree
zpe.sumelectzpe: -1874.341093 hartree
zpe.sumelectthermal: -1874.321724 hartree
zpe.sumelectthermalent: -1874.320779 hartree
zpe.sumelectthermalfe: -1874.392097 hartree
dipole: 3.6664 0.0091 0.3389
dipole: 3.6821
quadrupole: -123.7001 -136.4512 -114.3226
quadrupole: -7.0374 -7.3284 -8.6665
quadrupole: 1.1245 -11.6266 10.5021 -7.0374 -7.3284 -8.6665
hfenergy: -1874.6255828 hartree
pointgroup: C01 [X(C9H19Cl2N2O2P1)]
dipole: -1.3998886 -0.2870235 0.2376697 debye
polarizability: 184.0002612|10.7921338|159.2696134|-9.7724022|-7.8558365|131.3851654 unknown
InChI: InChI=1S/C9H19Cl2N2O2P/c10-4-8-13(9-5-11)16(14,15)12-6-2-1-3-7-12/h14H,1-9H2
charge 0 multiplicity 1
35 atoms
Cl 1.118497 -3.893122 1.116552
Cl 5.061751 1.432291 -0.968974
P  0.014148 1.310072 0.229146
O  -0.085345 1.598329 1.952967
O  0.363064 2.629954 -0.608107
N  -1.487024 0.444373 0.045475
N  1.242483 0.096746 -0.011507
C  -1.781574 -0.076648 -1.321784
C  -2.69923 0.900255 0.786782
C  -2.773148 -1.256035 -1.23543
C  -3.691818 -0.27315 0.916974
C  -4.05379 -0.84863 -0.471253
C  1.287749 -1.110124 0.843535
C  2.440786 0.447254 -0.810226
C  0.930311 -2.359741 0.025017
C  3.459968 1.248565 0.019121
H  -0.833183 -0.395263 -1.791907
H  -2.216455 0.728545 -1.955427
H  -3.189112 1.741807 0.246125
H  -2.383473 1.259087 1.778267
H  -2.289119 -2.104455 -0.71276
H  -3.018895 -1.593539 -2.260618
H  -4.600058 0.083091 1.439831
H  -3.23313 -1.062653 1.542846
H  -4.601778 -0.080531 -1.055573
H  -4.73028 -1.717073 -0.366879
H  2.297487 -1.227772 1.282273
H  0.579133 -0.997521 1.681505
H  2.904138 -0.487255 -1.174939
H  2.137407 1.045612 -1.685377
H  0.315273 2.470344 2.199454
H  -0.118064 -2.348087 -0.301788
H  1.608364 -2.51825 -0.826678
H  3.108414 2.272955 0.210119
H  3.742802 0.738769 0.95264
