program: Gaussian 09
title: 000253720
version: EM64L-G09RevD.01
frameworkgroup: C1[X(C19H16N4O)]
method: RPBEPBE
basis: SDD
operation: Freq
keyword: #p
keyword: freq=noraman
keyword: PBEPBE/SDD
title: #p freq=noraman PBEPBE/SDD
converged: YES YES NO NO
title: Mulliken charges:
elementType: O N N N N C C C C C C C C C C C C C C C C C C C H H H H H H H H H H H H H H H H
charge: -0.301445 -0.143482 -0.178916 -0.038580 0.053475 0.132443 -0.594444 0.229403 -0.553651 -0.153415 0.487997 -0.214807 0.518551 -0.211720 -0.385116 -0.384428 -0.356055 -0.446738 -0.228222 -0.228816 -0.227621 -0.216104 -0.231683 -0.238970 0.271863 0.228470 0.242527 0.278039 0.262246 0.259257 0.222529 0.288518 0.244924 0.233201 0.228374 0.229275 0.229818 0.229766 0.231238 0.232297
chargesum: 0.00000
title: Mulliken charges with hydrogens summed into heavy atoms:
elementType: O N N N N C C C C C C C C C C C C C C C C C C C
charge: -0.301445 -0.143482 -0.178916 -0.038580 0.053475 0.132443 -0.094110 0.229403 -0.033085 -0.153415 0.487997 0.047439 0.518551 0.047537 -0.162587 -0.095910 -0.111131 -0.213537 0.000152 0.000459 0.002197 0.013662 -0.000445 -0.006673
polarizability: 2.97547509e+02 7.53715349e+00 2.18825408e+02 1.54116042e+01 -4.03773615e+00 1.59334032e+02
1716.lowfreq: -6.2499 -3.6273 -0.0002 0.0005 0.0008 5.3731 10.3998 18.2738 26.6967
frequency: 9.2510 17.8422 26.6146 39.7731 47.5253 58.6314 107.4751 122.2206 151.5978 190.0301 205.5234 242.9462 249.4429 289.8986 326.1432 338.6095 353.3485 390.5663 402.2490 405.3100 449.1658 454.9427 510.5665 524.8921 550.8526 571.2754 575.7815 615.7346 616.8297 620.6428 641.6883 670.5181 687.2882 705.5896 706.6846 721.3938 744.5234 772.8005 779.0807 795.3375 811.9068 816.5423 827.8016 854.7325 862.7685 892.7925 912.2232 932.5901 939.5994 948.9153 966.3035 979.1617 988.1107 990.3526 990.6943 999.6728 1007.8498 1026.2941 1027.2465 1037.7504 1079.4564 1087.1064 1114.9914 1163.4279 1169.7625 1174.4636 1174.5300 1183.0926 1190.7189 1192.7781 1211.1160 1218.3023 1261.5404 1285.9056 1314.3300 1326.9700 1334.8834 1343.3054 1360.3468 1368.2475 1369.0331 1385.3439 1386.7492 1393.1947 1442.7771 1443.6557 1447.0457 1460.6648 1473.6641 1479.6202 1486.5334 1488.5242 1528.6953 1595.3955 1595.9413 1614.0664 1615.6096 1636.2528 3007.5481 3026.2875 3064.0330 3096.9589 3112.6157 3117.0600 3125.7669 3125.9392 3136.1732 3137.6604 3147.8541 3149.1741 3158.4500 3163.9794 3166.4173 3232.8177
redmass: 5.3852 3.9842 4.0177 5.7258 6.3283 4.8768 8.6810 5.4509 4.3473 6.5179 4.9917 5.3064 5.9399 6.4168 2.6383 6.0679 2.4145 3.7032 2.8025 2.8615 3.4697 3.8923 5.7184 5.8434 4.6427 5.2924 4.6229 6.1337 6.2615 5.3849 5.2582 5.2520 8.4635 1.8520 2.6862 2.1114 2.1446 6.8893 2.9268 4.3444 2.2173 3.9040 2.1419 1.2488 1.2549 1.4320 1.5293 2.8120 1.4884 2.3751 2.0462 1.3925 1.4958 4.5677 5.9033 1.3309 1.3218 2.2529 2.3002 5.6048 1.8812 1.6037 2.5293 1.7901 1.9620 1.0578 1.0667 2.5313 1.1737 1.1647 2.8170 2.9263 2.6735 1.6428 2.3365 1.7091 1.3371 1.7721 1.7627 1.5623 3.0235 5.3614 5.3211 2.4022 2.3047 2.1947 2.1291 1.9749 1.4390 2.2650 2.0852 1.9780 5.7032 6.0832 6.0846 5.9538 6.0240 10.8605 1.0589 1.0619 1.1036 1.1031 1.0882 1.0880 1.0867 1.0864 1.0917 1.0911 1.0961 1.0960 1.0927 1.1015 1.1015 1.0985
irintensity: 0.1015 0.0260 0.0592 0.0974 0.2921 0.0680 8.0185 0.1503 1.0765 3.1022 0.7640 1.0566 3.2617 3.9757 5.1932 6.5534 4.1342 5.7331 0.3058 0.2150 2.6753 1.2437 16.0584 6.8073 3.5631 2.1651 7.2725 4.6791 0.4085 19.7396 13.8117 17.1601 0.6774 36.3013 33.8167 92.3780 38.9406 1.1010 14.4331 3.8941 13.5183 16.9007 7.8984 0.1801 1.2184 13.3440 0.4052 4.8573 3.8822 6.9622 21.6951 0.0193 1.4513 0.2255 0.7166 0.4494 4.0179 11.2126 6.8853 22.1042 19.0327 10.5215 14.3646 0.8682 50.0532 0.6700 0.9187 84.3148 4.6200 0.9454 14.6724 11.9600 1.8084 33.5855 46.4463 26.7362 2.5038 11.2490 43.6241 39.4087 24.8099 22.5621 0.1264 57.7203 5.0580 20.7632 14.1552 1.4203 45.1921 6.5914 11.5311 40.4319 87.7637 5.7304 1.2825 3.4607 4.9685 362.2949 36.2294 30.7108 14.4999 0.3812 10.3429 8.4520 2.5998 2.6493 7.9523 10.2666 23.6294 34.2764 3.8470 29.2775 21.5242 1.3369
temp: 298.150 k
press: 1.00000 atm
elementType: 8 7 7 7 7 6 6 6 6 6 6 6 6 6 6 6 6 6 6 6 6 6 6 6 1 1 1 1 1 1 1 1 1 1 1 1 1 1 1 1
symmnumber: 1
zpe: 818668.4 jmol-1
zpe.correction: 0.311814 hartree
zpe.thermalcorrener: 0.330888 hartree
zpe.thermalcorrenthalpy: 0.331832 hartree
zpe.thermalcorrgfe: 0.260115 hartree
zpe.sumelectzpe: -1026.203899 hartree
zpe.sumelectthermal: -1026.184826 hartree
zpe.sumelectthermalent: -1026.183882 hartree
zpe.sumelectthermalfe: -1026.255599 hartree
dipole: 0.0349 2.8268 1.8132
dipole: 3.3585
quadrupole: -104.7598 -144.9021 -149.6996
quadrupole: 1.0692 3.0072 -18.9311
quadrupole: 28.3607 -11.7816 -16.5791 1.0692 3.0072 -18.9311
hfenergy: -1026.5157135 hartree
pointgroup: C01 [X(C19H16N4O1)]
dipole: -0.0846742 1.0749671 -0.7636865 debye
polarizability: 299.0766629|-4.1452294|218.7216684|9.0969024|1.8233288|157.9086177 unknown
InChI: InChI=1S/C19H16N4O/c24-19-17-18(20-13-22(17)11-15-7-3-1-4-8-15)21-14-23(19)12-16-9-5-2-6-10-16/h1-10,13-14H,11-12H2
charge 0 multiplicity 1
40 atoms
O  -0.041641 -0.079634 -1.959766
N  2.200771 -1.46062 -0.244155
N  -1.518516 -1.197669 -0.471991
N  1.68037 -2.83582 1.520809
N  -0.791004 -2.632973 1.349729
C  0.807611 -1.485546 -0.150531
C  3.029124 -0.666854 -1.194546
C  -0.20403 -0.850257 -0.954931
C  -2.694701 -0.629843 -1.197161
C  0.504962 -2.343969 0.945414
C  3.377938 0.725019 -0.675098
C  2.666287 -2.280655 0.782924
C  -3.548218 0.28751 -0.332113
C  -1.731622 -2.042771 0.623771
C  4.56204 0.938406 0.073686
C  2.516024 1.819369 -0.940295
C  -2.960428 1.377494 0.359855
C  -4.945554 0.081284 -0.233231
C  4.879901 2.2261 0.560661
C  2.835032 3.107425 -0.455131
C  -3.758703 2.244233 1.135938
C  -5.747708 0.951853 0.54037
C  4.015205 3.313885 0.296958
C  -5.15572 2.034873 1.228043
H  2.455733 -0.594878 -2.132558
H  3.946049 -1.253649 -1.382231
H  -3.300439 -1.46358 -1.595888
H  -2.261471 -0.079854 -2.05242
H  3.728569 -2.445011 0.951092
H  -2.781149 -2.206377 0.88658
H  5.240477 0.098657 0.2733
H  1.603323 1.649686 -1.524069
H  -1.879176 1.545396 0.28874
H  -5.409399 -0.760289 -0.763262
H  5.798151 2.382174 1.13762
H  2.167009 3.949805 -0.667038
H  -3.29504 3.082163 1.66828
H  -6.82786 0.781943 0.609673
H  4.261951 4.313941 0.670842
H  -5.774449 2.708032 1.831632
