program: Gaussian 09
title: 000253395
version: EM64L-G09RevD.01
frameworkgroup: C1[X(C13H17NO2)]
method: RPBEPBE
basis: SDD
operation: Freq
keyword: #p
keyword: freq=noraman
keyword: PBEPBE/SDD
title: #p freq=noraman PBEPBE/SDD
converged: YES YES NO NO
title: Mulliken charges:
elementType: O O N C C C C C C C C C C C C C H H H H H H H H H H H H H H H H H
charge: -0.433398 -0.218736 -0.628283 0.230643 -0.258395 -0.497546 -0.425880 -0.376506 -0.412108 0.464931 0.091003 -0.440231 -0.407909 -0.228100 -0.249565 -0.244126 0.233676 0.209181 0.234894 0.206495 0.215606 0.220270 0.193582 0.192278 0.204715 0.301648 0.272494 0.244625 0.249196 0.380023 0.223456 0.224225 0.227841
chargesum: 0.00000
title: Mulliken charges with hydrogens summed into heavy atoms:
elementType: O O N C C C C C C C C C C C C C
charge: -0.053375 -0.218736 -0.054141 0.230643 -0.024719 -0.053472 -0.003779 0.037347 -0.015115 0.464931 0.091003 -0.195606 -0.158713 -0.004644 -0.025340 -0.016284
polarizability: 1.78687701e+02 -8.10610954e+00 1.31071991e+02 -4.00808094e+00 -1.46246827e+01 1.24970775e+02
1716.lowfreq: -16.4279 -8.2383 -0.0008 -0.0007 -0.0006 13.2392 41.1045 47.8141 72.6292
frequency: 40.9544 47.7599 72.4855 85.9878 138.1509 163.2356 209.5421 220.1645 246.2560 257.8231 272.4273 315.0717 329.4843 373.3331 378.9537 406.9763 455.7858 494.1079 501.5658 532.3721 579.3490 603.8465 617.7219 625.3420 695.3106 700.2837 710.1590 738.4209 773.8225 792.3558 836.0465 852.9886 856.6279 890.4635 912.4882 930.5995 946.5002 977.9684 984.3178 990.5819 994.6548 1003.4719 1020.6902 1030.0096 1046.9743 1069.7111 1083.0339 1104.5712 1143.9611 1161.9625 1172.1794 1189.5159 1202.1348 1209.2158 1236.4516 1266.3604 1279.3440 1286.8240 1302.1055 1319.6710 1331.2417 1337.3938 1344.9528 1352.1609 1361.6659 1382.8106 1441.2893 1449.2809 1461.9515 1462.6660 1474.4981 1482.0364 1588.2644 1611.8669 1642.0219 1653.0439 2964.4005 2974.5270 2991.9047 2992.3779 3007.1399 3030.4390 3040.6595 3055.8099 3062.5237 3118.6282 3124.7095 3138.1993 3147.9179 3162.3806 3430.2160 3500.1296 3545.2843
redmass: 3.8975 10.8050 4.7117 3.7805 3.4162 3.4724 2.9148 1.8116 1.8324 3.4715 3.7396 2.1868 3.8870 2.9128 3.1152 2.8337 2.9097 2.7901 2.7239 2.9381 1.4148 3.3037 5.8721 3.8397 3.8430 3.5013 1.5951 1.6525 1.8706 2.6140 1.6409 2.7750 1.2795 2.1862 1.7922 1.6873 2.3552 1.4331 2.9502 6.0216 1.3458 2.0481 2.0575 2.0860 2.5068 1.7783 1.4550 1.8272 1.6890 1.6055 1.0568 1.1294 1.9069 2.4357 1.4120 1.5729 1.7349 1.5450 1.4826 1.5011 1.3396 1.3332 1.4060 1.4629 1.4390 4.8523 2.1158 1.0863 1.0860 1.0883 1.0924 2.2607 5.8947 6.0665 2.5346 1.5920 1.0629 1.0623 1.0611 1.0627 1.0834 1.0961 1.1005 1.1016 1.1013 1.0848 1.0872 1.0923 1.0950 1.1012 1.0458 1.0641 1.0952
irintensity: 0.7147 1.9442 0.4925 0.0813 0.2985 1.9384 3.3607 40.0734 32.1949 9.6833 0.8864 0.6913 15.7468 1.3637 5.4123 1.0324 10.1975 4.5049 3.1644 21.4811 125.2841 6.4594 0.5668 9.6552 36.2272 26.8755 47.5468 146.9901 30.0479 15.6142 4.0363 7.1923 1.2161 4.1045 12.3583 0.4317 4.6122 3.4784 51.5998 1.4560 1.0556 5.5306 71.3405 4.9118 67.8244 21.2435 4.1802 0.9741 2.5049 4.8302 0.0710 0.6344 1.0761 0.3962 1.1279 5.5771 0.4423 2.8846 3.0146 1.1014 1.0719 1.3204 0.4798 0.3379 0.1887 0.1788 8.6666 8.7977 12.6711 5.0838 9.8702 19.7054 2.3710 7.5170 56.9254 213.2640 39.6204 26.6968 82.2434 7.2525 8.5273 61.4891 15.9346 2.9423 70.7498 3.7965 0.6599 22.0767 35.8806 20.9615 2.4911 13.8053 3.1493
temp: 298.150 k
press: 1.00000 atm
elementType: 8 8 7 6 6 6 6 6 6 6 6 6 6 6 6 6 1 1 1 1 1 1 1 1 1 1 1 1 1 1 1 1 1
symmnumber: 1
zpe: 725803.5 jmol-1
zpe.correction: 0.276444 hartree
zpe.thermalcorrener: 0.291247 hartree
zpe.thermalcorrenthalpy: 0.292191 hartree
zpe.thermalcorrgfe: 0.234692 hartree
zpe.sumelectzpe: -709.593801 hartree
zpe.sumelectthermal: -709.578997 hartree
zpe.sumelectthermalent: -709.578053 hartree
zpe.sumelectthermalfe: -709.635553 hartree
dipole: 0.5499 -0.0106 -0.9981
dipole: 1.1396
quadrupole: -87.9638 -95.5873 -93.7335
quadrupole: 0.4925 0.0336 -8.1690
quadrupole: 4.4644 -3.1591 -1.3053 0.4925 0.0336 -8.1690
hfenergy: -709.8702446 hartree
pointgroup: C01 [X(C13H17N1O2)]
dipole: -0.2081026 0.0194607 -0.3966688 debye
polarizability: 177.2242215|-11.4215212|132.2421311|5.9121348|14.1395332|125.2641142 unknown
InChI: InChI=1S/C13H17NO2/c14-13(12(15)16)9-5-4-8-11(13)10-6-2-1-3-7-10/h1-3,6-7,11,15H,4-5,8-9,14H2
charge 0 multiplicity 1
33 atoms
O  -1.043825 -2.231813 -1.187848
O  -0.611106 -2.647299 1.048851
N  -1.163922 0.029357 1.788251
C  -1.348743 -0.353366 0.380778
C  -0.471371 0.57316 -0.560497
C  -2.857797 -0.210542 -0.004217
C  -0.977631 2.036816 -0.477131
C  -3.337366 1.255666 0.050857
C  -2.469161 2.149339 -0.862125
C  1.026936 0.436578 -0.278322
C  -0.952859 -1.837823 0.160132
C  1.819126 -0.431713 -1.076008
C  1.667893 1.15459 0.767841
C  3.202254 -0.587143 -0.835958
C  3.051041 0.999706 1.012087
C  3.824872 0.126729 0.21349
H  -0.657065 0.206038 -1.588513
H  -3.463553 -0.841087 0.678286
H  -2.995529 -0.611258 -1.025439
H  -0.355908 2.665632 -1.143168
H  -0.849867 2.411514 0.554973
H  -3.274247 1.626224 1.091139
H  -4.400122 1.302257 -0.257023
H  -2.605679 1.841993 -1.92034
H  -2.798128 3.203632 -0.78817
H  -0.19919 -0.118923 2.10942
H  -1.822084 -0.450492 2.413934
H  1.341522 -0.984173 -1.89416
H  1.086493 1.847983 1.385469
H  -0.795588 -3.1937 -1.259761
H  3.793362 -1.260405 -1.467492
H  3.52554 1.563827 1.823416
H  4.897901 0.009398 0.402248
