program: Gaussian 09
title: 000253370
version: EM64L-G09RevD.01
frameworkgroup: C1[X(C7H9ClN4)]
method: RPBEPBE
basis: SDD
operation: Freq
keyword: #p
keyword: freq=noraman
keyword: PBEPBE/SDD
title: #p freq=noraman PBEPBE/SDD
converged: YES YES NO NO
title: Mulliken charges:
elementType: Cl N N N N C C C C C C C H H H H H H H H H
charge: -0.053553 -0.386720 -0.066848 -0.653607 0.047564 0.204273 -0.440274 0.274050 -0.276689 -0.046573 -0.370439 -0.572973 0.301114 0.269652 0.219181 0.244693 0.303154 0.318359 0.247656 0.222121 0.215859
chargesum: 0.00000
title: Mulliken charges with hydrogens summed into heavy atoms:
elementType: Cl N N N N C C C C C C C
charge: -0.053553 -0.085606 -0.066848 -0.032094 0.047564 0.204273 0.048559 0.274050 -0.276689 0.198120 -0.122782 -0.134994
polarizability: 1.81217412e+02 9.17919193e+00 1.17219475e+02 7.00943867e+00 2.67700644e+00 6.19531124e+01
1716.lowfreq: -8.4276 -0.0023 -0.0013 -0.0010 3.1545 6.4063 24.7493 50.2716 87.6351
frequency: 24.7394 50.2398 87.6120 124.7902 182.4812 207.4005 240.2672 262.2818 286.0890 338.4755 355.8660 376.0322 434.3755 503.1554 538.6721 559.2035 586.1718 592.9133 610.4074 656.1231 682.1219 756.9402 783.7539 845.3053 897.2306 913.2369 953.0606 971.3295 1011.0379 1067.3792 1076.0403 1128.0759 1163.7836 1200.6309 1254.5874 1282.2672 1304.6514 1324.9944 1340.1265 1393.7997 1426.5662 1438.2439 1449.4360 1466.8908 1545.0820 1562.0397 1632.3503 1655.4645 2997.1205 3066.5392 3087.0380 3109.2065 3179.9727 3198.3438 3497.6186 3527.3761 3631.4449
redmass: 3.8834 5.7029 3.0570 3.0376 3.9242 10.3334 5.6540 3.6972 2.6854 1.4225 6.1809 2.6223 2.4779 3.3391 3.3066 2.3549 2.6683 1.4271 2.6217 2.0651 3.4835 9.6659 7.3409 3.3012 1.4082 1.6780 1.3436 1.9023 1.1946 4.3330 2.0994 2.0678 3.8405 2.6980 1.3289 1.2263 4.0479 2.5345 1.4102 1.7783 1.2004 2.0595 1.9229 1.6760 3.7755 4.9300 1.2538 4.5420 1.0617 1.1001 1.0603 1.0952 1.0925 1.1141 1.0452 1.0762 1.1015
irintensity: 1.1200 0.0893 0.5204 1.1709 0.7649 0.5645 1.8359 4.5955 5.7486 38.4955 14.8546 12.6632 7.5195 1.8505 29.3968 57.2510 40.2093 216.3727 74.0419 36.9175 4.6814 4.1178 25.2050 38.6408 15.3186 2.8711 79.2898 13.9098 22.5538 45.4521 138.1810 3.9918 9.1969 12.3987 37.5700 2.9559 20.2024 50.6665 15.5064 61.9147 26.1240 36.6195 92.8271 26.7548 572.2374 51.9187 127.1034 21.2088 56.4423 3.6765 12.4684 7.8429 12.9352 23.5607 32.2253 29.0042 32.2520
temp: 298.150 k
press: 1.00000 atm
elementType: 17 7 7 7 7 6 6 6 6 6 6 6 1 1 1 1 1 1 1 1 1
symmnumber: 1
zpe: 417726.3 jmol-1
zpe.correction: 0.159104 hartree
zpe.thermalcorrener: 0.171016 hartree
zpe.thermalcorrenthalpy: 0.171960 hartree
zpe.thermalcorrgfe: 0.119705 hartree
zpe.sumelectzpe: -950.300619 hartree
zpe.sumelectthermal: -950.288707 hartree
zpe.sumelectthermalent: -950.287762 hartree
zpe.sumelectthermalfe: -950.340017 hartree
dipole: -3.6575 -3.8708 -1.2004
dipole: 5.4590
quadrupole: -82.9179 -72.5401 -77.2420
quadrupole: -1.5378 -1.1873 3.2420
quadrupole: -5.3513 5.0266 0.3247 -1.5378 -1.1873 3.2420
hfenergy: -950.4597221 hartree
pointgroup: C01 [X(C7H9Cl1N4)]
dipole: 1.5266858 1.2634732 -0.8280576 debye
dipolederiv: -0.7210619 0.3702206 0.1225796 0.4644397 -0.435085 -0.0798871 0.1291145 -0.07801 -0.1234115 -1.5536568 -0.1033304 0.174512 -0.2590573 -0.2279081 0.1577302 0.3724566 0.0991926 -0.6132097 -0.7361812 0.0906633 0.1074079 -0.4409186 -0.4000897 0.0959155 0.1329844 -0.0074335 -0.2296653 -0.3431924 -0.3040127 -0.1915041 -0.1017341 -1.2446966 0.1141968 -0.1778517 -0.0132283 -0.3932915 -0.6075694 0.0650765 0.1184617 0.0649333 -0.8838667 0.0713279 0.1871654 0.0635559 -0.1960291 1.7755536 0.3978405 -0.4276199 0.3910419 0.1262445 -0.0624318 -0.4876682 -0.1720707 0.2641841 0.5944256 -0.1233111 -0.0788065 -0.5184578 0.1572279 0.0431678 -0.0874741 0.0231413 0.2801687 -0.9427843 0.2087996 0.2895832 0.376668 0.9426515 -0.2827019 0.3226102 -0.262216 0.0441757 1.2812497 -0.6502282 -0.2839279 -0.3928565 0.8348986 0.0113282 -0.4044021 0.1876537 0.07007 0.1370855 0.1278889 0.0457161 0.2595808 -0.1676633 -0.0811025 0.1663306 -0.015667 0.0953335 0.5538748 -0.1886217 -0.1595692 0.1119966 0.5148745 -0.0753295 -0.2252156 -0.006798 -0.0115385 -0.2687632 0.0832993 -0.0014891 0.0377873 -0.3703646 -0.0484072 -0.0507503 -0.0481341 0.1145699 0.1548095 0.0305762 0.0404185 0.0687578 0.1144474 -0.0445518 -0.0359592 -0.0710299 0.3201635 0.1269611 -0.0701914 -0.0459527 0.0714367 0.0157866 -0.0219416 -0.0872188 0.0103061 0.1042356 -0.1096007 0.0129673 0.1183985 0.0352856 0.0913117 0.0686048 0.0845964 0.016514 -0.1137594 0.0717924 -0.0466951 0.0600116 -0.0697548 0.1315098 0.0377441 0.004271 0.0239143 -0.0890658 0.2462881 0.1136596 0.0941289 0.0280459 0.2528272 -0.0094686 0.1199475 0.1189183 0.1869828 0.1951954 0.0655113 0.0642171 0.0005016 0.2687857 0.0393157 0.0376158 0.0573796 0.2926487 0.0773404 -0.0050099 0.0186467 -0.017868 -0.0710114 0.0277523 0.033773 0.030963 0.1248512 -0.0178856 -0.0409565 -0.0898189 -0.0785345 0.1788344 0.0019595 -0.1105267 -0.006573 -0.0252845 0.0861195 -0.0341461 0.0246062 -0.0312937 0.1712857 0.0367791 0.0762013 0.0496216 -0.1021283 unknown
polarizability: 178.6219616|-1.0735507|114.7972637|-22.3973062|-7.8921154|66.9707742 unknown
InChI: InChI=1S/C7H9ClN4/c1-2-3-10-7-5(9)6(8)11-4-12-7/h2,4,10H,1,3,9H2
charge 0 multiplicity 1
21 atoms
Cl -3.67739 1.330137 0.832786
N  1.281413 0.440584 -0.561204
N  -0.07493 -1.407637 0.069811
N  -0.921614 2.205695 -0.27591
N  -2.369558 -1.075503 0.763627
C  0.056868 -0.066701 -0.153098
C  2.479918 -0.406743 -0.742348
C  -1.059355 0.842815 0.006693
C  -2.228111 0.234963 0.506429
C  3.489307 -0.207045 0.372582
C  -1.284736 -1.855859 0.503441
C  4.768146 0.202729 0.180464
H  1.441388 1.439473 -0.40882
H  2.119098 -1.450326 -0.752872
H  2.944032 -0.18428 -1.721821
H  3.123247 -0.422963 1.386776
H  -0.355927 2.482074 -1.07918
H  -1.72185 2.802046 -0.059926
H  -1.391385 -2.930262 0.669853
H  5.466942 0.31905 1.016003
H  5.156697 0.421553 -0.822686
