program: Gaussian 09
title: 000253371
version: EM64L-G09RevD.01
frameworkgroup: C1[X(C7H10N4O4)]
method: RPBEPBE
basis: SDD
operation: Freq
keyword: #p
keyword: freq=noraman
keyword: PBEPBE/SDD
title: #p freq=noraman PBEPBE/SDD
converged: YES YES NO NO
title: Mulliken charges:
elementType: O O O O N N N N C C C C C C C H H H H H H H H H H
charge: -0.445930 -0.279012 -0.308819 -0.246832 -0.467932 -0.430016 -0.377295 -0.354967 0.303072 -0.355796 0.109393 -0.223152 0.286574 -0.308854 0.148763 0.228162 0.240087 0.335448 0.305926 0.331104 0.223339 0.228751 0.367279 0.353274 0.337435
chargesum: 0.00000
title: Mulliken charges with hydrogens summed into heavy atoms:
elementType: O O O O N N N N C C C C C C C
charge: -0.108495 -0.279012 -0.308819 -0.246832 -0.132484 -0.124090 -0.010017 -0.001694 0.303072 0.112453 0.109393 0.107952 0.286574 0.143235 0.148763
polarizability: 1.88186896e+02 1.19044997e+01 1.21849838e+02 -1.17298762e+01 -1.01413576e+00 6.28766440e+01
1716.lowfreq: -3.2866 -0.0004 0.0001 0.0005 2.5457 4.1404 28.0153 37.8539 66.6202
frequency: 27.9585 37.8186 66.6181 85.3210 101.5307 129.8237 156.9604 181.5477 221.9811 259.9534 280.2297 300.2858 364.4533 366.2772 378.2506 401.3592 452.7719 494.8273 518.9556 553.1453 582.2185 635.0853 691.8017 700.5140 702.8949 713.7016 736.4687 750.5048 777.6795 813.7264 852.7104 874.5285 900.0067 944.6168 967.5070 1006.3841 1076.6707 1112.8499 1134.8326 1172.7054 1202.0187 1223.5830 1257.9408 1275.3365 1327.4714 1335.4912 1355.3800 1357.3256 1371.8137 1389.2491 1427.2600 1430.7775 1467.7058 1485.1103 1525.4516 1602.5361 1627.2757 1659.9807 1687.1097 2993.4967 3012.5993 3080.4118 3090.6425 3205.9037 3441.3984 3531.3233 3557.8142 3561.0978 3568.0605
redmass: 6.6052 6.3267 6.0881 4.5214 5.1730 3.9314 5.3113 7.4069 5.0691 3.2282 2.5691 2.0343 3.4596 5.6227 6.5426 2.9160 1.3227 3.0200 6.7126 5.2242 5.4556 1.3025 1.3999 1.6926 4.5726 6.6914 3.7032 7.0755 2.4300 4.2138 2.7024 3.0060 1.3090 3.0039 2.7192 3.2679 1.9468 4.0635 2.0652 1.2634 4.5124 1.5185 2.1447 1.5331 1.1659 2.4654 1.5401 1.4621 1.2316 2.9854 1.4479 1.4064 1.0864 1.8625 2.7179 6.8746 4.6375 6.4690 5.9700 1.0649 1.0597 1.1015 1.1032 1.0960 1.0764 1.0772 1.0661 1.0780 1.0784
irintensity: 0.7147 0.8483 4.8105 11.0686 16.3040 8.6751 2.5971 3.0051 19.9375 45.6333 40.9218 106.0411 33.4918 10.7977 9.8824 24.2515 14.4485 13.4857 11.8905 13.9705 10.4933 71.0320 53.1527 69.7917 0.7618 11.3694 67.2835 6.4420 151.4802 9.0569 10.3700 20.4706 40.7957 9.9593 12.9960 93.8579 5.0898 7.1087 35.7381 21.1218 14.8550 185.3939 44.1636 17.7967 31.7551 16.7264 89.5888 29.4084 27.0501 208.1534 20.6064 96.6592 7.1438 301.7501 663.6483 467.2923 8.2532 262.9180 536.5941 31.5640 31.3938 16.3385 42.3105 7.1808 70.2086 68.4101 1.4827 35.4442 91.1437
temp: 298.150 k
press: 1.00000 atm
elementType: 8 8 8 8 7 7 7 7 6 6 6 6 6 6 6 1 1 1 1 1 1 1 1 1 1
symmnumber: 1
zpe: 493932.4 jmol-1
zpe.correction: 0.188129 hartree
zpe.thermalcorrener: 0.202635 hartree
zpe.thermalcorrenthalpy: 0.203579 hartree
zpe.thermalcorrgfe: 0.145116 hartree
zpe.sumelectzpe: -791.571339 hartree
zpe.sumelectthermal: -791.556833 hartree
zpe.sumelectthermalent: -791.555889 hartree
zpe.sumelectthermalfe: -791.614352 hartree
dipole: 1.5291 -0.2370 -1.3298
dipole: 2.0402
quadrupole: -111.9688 -86.1792 -88.3468
quadrupole: 2.4981 -7.0209 -1.0927
quadrupole: -16.4705 9.3191 7.1515 2.4981 -7.0209 -1.0927
hfenergy: -791.7594683 hartree
pointgroup: C01 [X(C7H10N4O4)]
dipole: 0.6044954 -0.1332371 -0.5110141 debye
dipolederiv: -0.2338508 -0.0825 -0.1170977 -0.1547808 -0.6226029 -0.1113821 -0.2152065 -0.079679 -0.7426205 -0.611402 -0.1188725 0.0389958 -0.1526852 -1.2104298 0.1150914 0.0455653 0.1047557 -0.3918795 -0.8064867 -0.0198856 0.0276353 0.1593911 -0.8545501 0.009043 0.0223242 0.0548194 -0.3806245 -1.6592795 -0.2445344 0.1724337 -0.2103302 -0.5114904 0.0384728 0.182445 0.0440257 -0.4155455 -2.1067091 -0.0704574 0.1667414 0.6454824 -0.4052174 -0.0417985 0.1463905 0.0219352 -0.3392302 -1.6383384 -0.1527994 0.0168146 -0.4676694 -0.416921 0.0156881 0.0357421 -0.0298373 -0.5596918 -0.8493777 -0.382057 0.1027773 -0.4319466 -0.6643866 0.0912207 0.11096 0.084201 -0.3540619 -1.3660095 -0.4727716 0.1665305 0.559997 -0.4004991 -0.0543369 0.0748588 0.0704523 -0.3174981 1.0332798 0.4833855 -0.1562067 0.4664358 -0.5996545 0.0210635 -0.1816919 0.0045214 0.0391005 0.6801222 -0.112581 -0.0197447 -0.2599889 0.1712692 0.0400735 -0.0698328 -0.0503844 0.1457524 0.9483354 0.0228452 -0.0882824 0.2327984 1.5154515 -0.1717374 -0.1134891 -0.1383427 0.2815134 0.564732 0.614263 -0.1419293 -0.1340786 0.3379967 -0.032281 -0.0669221 -0.1209223 -0.0525235 2.7548805 0.1233755 -0.1884456 -0.3575939 1.113901 -0.0164948 -0.2214547 -0.0988127 0.3270073 0.2166373 0.0316135 0.035846 0.1238918 0.4884407 0.1215039 0.1327317 0.1980912 0.4244161 2.2333286 0.3252472 -0.2594142 -0.1311059 0.964279 -0.0598514 -0.2268135 -0.1105387 0.3567249 -0.0702706 -0.0289655 0.057589 -0.0572089 0.0168621 0.1286012 0.0614165 0.0770622 0.0174763 0.0356623 -0.0455878 -0.0606968 0.0783873 -0.0308033 -0.1065617 -0.0300196 -0.0785503 0.021073 0.2606903 0.0095688 0.0073871 -0.1284591 0.2127438 0.0222081 0.027235 0.0065192 0.3103397 0.115608 0.0463941 0.0178297 0.096712 0.1172205 0.0293731 0.0625653 0.0273844 0.3259058 0.1851723 0.0150665 0.0046518 0.045222 0.1053026 0.0069501 -0.0011211 0.0088165 0.2001509 -0.1404712 0.1110499 0.0203273 0.0754451 0.0151887 -0.0443068 -0.0213244 -0.0517407 0.0694085 0.0243644 -0.1287906 0.0690213 -0.0910495 -0.0617922 0.0266689 0.0605461 0.0329524 -0.0351522 0.2035598 -0.0415399 0.022554 -0.0591716 0.1978395 0.0219728 0.0242692 0.0206192 0.3386592 0.1579551 0.0091159 0.0233078 0.0620412 0.2796081 0.0014505 0.0178913 0.0063309 0.3468886 0.0678675 0.1094179 0.0813746 0.0902645 0.2422439 -0.0506311 0.1429349 -0.0036788 0.384411 unknown
polarizability: 188.0906385|11.4155805|121.4155767|-12.2308664|-6.1529007|63.4071629 unknown
InChI: InChI=1S/C7H10N4O4/c12-2-1-8-6(14)10-4-3-9-7(15)11-5(4)13/h3,8-12H,1-2H2
charge 0 multiplicity 1
25 atoms
O  5.039933 0.661332 1.326373
O  -1.558088 2.446202 -0.297238
O  1.538869 -1.479518 -0.247658
O  -4.892266 -0.777216 0.466339
N  0.42643 0.587201 -0.350999
N  2.755727 0.48169 -0.625408
N  -3.20493 0.817952 0.082998
N  -2.652186 -1.453921 0.256142
C  -0.885597 0.131964 -0.136731
C  4.033365 -0.243367 -0.76883
C  -1.874313 1.225456 -0.127969
C  -1.297979 -1.171171 0.054324
C  1.571779 -0.216381 -0.400228
C  4.689023 -0.560649 0.589379
C  -3.677718 -0.497994 0.283308
H  4.714787 0.388283 -1.365371
H  3.849824 -1.18757 -1.314078
H  0.471238 1.608356 -0.468293
H  2.735918 1.480864 -0.831671
H  -0.588702 -1.999239 0.052926
H  5.646397 -1.082264 0.424742
H  4.021109 -1.215682 1.183053
H  -3.919759 1.55225 0.095061
H  -2.955257 -2.418898 0.397728
H  4.1988 1.112521 1.592601
