program: Gaussian 09
title: 000253398
version: EM64L-G09RevD.01
frameworkgroup: C1[X(C28H18)]
method: RPBEPBE
basis: SDD
operation: Freq
keyword: #p
keyword: freq=noraman
keyword: PBEPBE/SDD
title: #p freq=noraman PBEPBE/SDD
converged: YES YES NO NO
title: Mulliken charges:
elementType: C C C C C C C C C C C C C C C C C C C C C C C C C C C C H H H H H H H H H H H H H H H H H H
charge: 0.019326 0.251394 0.309125 0.193635 0.499413 0.124448 0.225674 -0.798132 0.428870 -0.429766 -0.509483 -0.371862 -0.560438 -0.481633 -0.381645 0.378552 -0.346633 0.365532 -0.444201 -0.415907 -0.260368 -0.249655 -0.262473 -0.251950 -0.428273 -0.408752 -0.244957 -0.243797 0.232107 0.259895 0.233337 0.258817 0.259325 0.252571 0.247172 0.221850 0.241401 0.237048 0.228096 0.228761 0.227239 0.229225 0.242096 0.238010 0.228657 0.228351
chargesum: 0.00000
title: Mulliken charges with hydrogens summed into heavy atoms:
elementType: C C C C C C C C C C C C C C C C C C C C C C C C C C C C
charge: 0.019326 0.251394 0.309125 0.193635 0.499413 0.124448 0.225674 -0.566025 0.428870 -0.169872 -0.276146 -0.112537 -0.301621 -0.234461 -0.129074 0.378552 -0.124783 0.365532 -0.202800 -0.178859 -0.032272 -0.020894 -0.035233 -0.022726 -0.186178 -0.170742 -0.016300 -0.015446
polarizability: 4.83067826e+02 2.59132739e+01 3.68784136e+02 -1.06955473e+00 -1.33303400e+00 1.82093345e+02
1716.lowfreq: -15.7175 -7.8532 -0.0003 0.0005 0.0010 3.3962 5.4608 33.5792 36.0174
frequency: -15.4619 33.5470 35.9948 65.3261 71.4584 130.3931 134.0252 148.3317 166.9329 178.0387 209.0167 225.5748 284.0756 302.1500 305.6808 323.8018 361.3017 378.3488 398.3898 420.4024 445.0691 446.5763 478.7569 494.2186 508.7309 517.1180 521.9762 532.2205 544.8728 570.7189 576.6802 581.0062 617.9343 637.5826 645.3025 649.3050 672.9666 707.3195 747.1172 757.0632 757.7498 759.0669 761.6794 774.5397 785.5788 790.0717 811.4079 814.2474 839.1114 853.7273 862.5355 870.3374 876.0585 885.0533 889.1981 914.1121 928.4774 935.3660 948.4454 956.4125 963.6713 969.8565 980.5533 985.6354 992.4251 992.9949 993.5519 994.3602 1022.9065 1024.6166 1041.4291 1097.6200 1117.1723 1131.9239 1155.5401 1160.9715 1171.8992 1173.4204 1177.5452 1186.4019 1218.6290 1227.3428 1235.2823 1247.5999 1251.5210 1266.9281 1274.9452 1282.0629 1326.4443 1340.2654 1352.8598 1372.7515 1393.4618 1399.8428 1406.4922 1414.5124 1420.0327 1429.7513 1435.0978 1439.7073 1456.2937 1466.1817 1488.3055 1504.5667 1508.5128 1543.6282 1568.0165 1575.8038 1587.8693 1603.3998 1616.6460 1621.9872 1630.5233 1639.1899 3119.1565 3119.5614 3121.0007 3121.7911 3124.2368 3124.4210 3126.5094 3131.4913 3132.2072 3139.4127 3142.4033 3148.8525 3149.1072 3151.1253 3158.9295 3161.7333 3163.3395 3164.9273
redmass: 4.4254 5.2122 5.0065 4.5806 4.2866 5.0775 4.6795 5.2983 4.2857 3.6984 5.9516 4.6776 4.7096 3.7159 4.7400 6.0892 5.2546 3.9163 3.2498 3.0714 3.2625 4.8854 2.5804 4.9321 6.5347 3.5272 6.1101 3.4994 5.7886 2.8737 4.7452 6.9039 5.7850 4.9516 6.2328 5.7596 3.2479 3.1667 3.9170 2.0397 1.5064 2.0848 1.3232 5.2717 2.8882 2.7483 2.8558 1.9021 1.4833 2.1110 2.6625 1.6404 1.7242 3.9637 1.8565 2.6635 2.4707 2.3725 3.9632 1.3927 1.4251 1.4280 1.3816 1.3375 2.0509 1.7709 1.4287 1.4248 2.2579 2.2381 2.1840 2.3341 2.0230 1.6911 1.3825 1.2611 1.1100 1.0929 1.1121 1.4150 1.6949 2.2673 1.7952 1.5119 1.6975 1.7689 1.8151 2.0258 2.4745 2.1065 2.8675 3.1386 4.8375 3.7522 2.8536 2.4121 3.2770 4.1511 3.5831 4.2226 2.6975 2.5986 3.2300 3.4693 3.6828 6.5768 7.4567 7.1298 5.6996 5.7248 6.2021 6.4366 6.6590 6.8222 1.0864 1.0859 1.0865 1.0875 1.0883 1.0901 1.0898 1.0888 1.0885 1.0910 1.0950 1.0965 1.0950 1.0927 1.0958 1.1004 1.1001 1.0993
irintensity: 0.0024 0.1769 0.2053 0.5784 0.0138 0.2107 0.1799 0.3616 1.2950 1.0191 0.1739 0.5095 0.0163 1.4754 0.2046 2.0417 0.1008 1.2660 0.0267 5.7696 4.2564 3.6153 19.4146 0.3509 0.2772 0.2616 0.5977 12.9316 7.7333 3.0659 1.3731 5.1511 1.2415 0.1805 2.6792 0.9976 1.6214 5.7893 4.4648 2.7503 33.1150 9.3753 99.2157 15.2396 1.4010 9.3841 19.4655 4.7035 24.7856 37.6119 5.4922 20.4704 19.0470 1.8520 7.1613 3.3471 9.7824 11.3280 2.5342 3.4416 3.4773 5.0589 3.5776 0.6872 1.1530 0.2448 0.0781 0.9781 4.3252 10.6216 8.7410 2.6150 4.2586 9.1446 3.6460 0.4443 2.0803 1.3627 2.7756 2.3719 1.7497 7.8707 6.1960 5.0425 8.9689 0.2085 6.8146 2.0742 1.6397 6.0282 8.2714 6.5025 5.8566 2.4956 1.6639 7.3760 0.4139 1.0509 1.0380 3.0082 1.7537 2.6829 1.3558 40.4000 7.1117 2.0694 3.6306 0.2807 1.6395 9.0735 0.4695 0.1282 0.2023 4.8949 1.6117 1.2285 1.3253 8.4896 4.7609 7.2941 2.8782 5.3354 11.7886 6.5692 32.2000 21.7244 18.8797 32.1708 22.7158 43.1807 46.2239 36.5843
temp: 298.150 k
press: 1.00000 atm
elementType: 6 6 6 6 6 6 6 6 6 6 6 6 6 6 6 6 6 6 6 6 6 6 6 6 6 6 6 6 1 1 1 1 1 1 1 1 1 1 1 1 1 1 1 1 1 1
symmnumber: 1
zpe: 952345.0 jmol-1
zpe.correction: 0.362729 hartree
zpe.thermalcorrener: 0.381836 hartree
zpe.thermalcorrenthalpy: 0.382780 hartree
zpe.thermalcorrgfe: 0.315430 hartree
zpe.sumelectzpe: -1075.999088 hartree
zpe.sumelectthermal: -1075.979982 hartree
zpe.sumelectthermalent: -1075.979038 hartree
zpe.sumelectthermalfe: -1076.046387 hartree
dipole: 0.3719 -0.0985 0.0122
dipole: 0.3849
quadrupole: -137.3837 -148.3427 -160.1824
quadrupole: -3.9025 2.2130 -1.0617
quadrupole: 11.2526 0.2936 -11.5461 -3.9025 2.2130 -1.0617
hfenergy: -1076.3618174 hartree
pointgroup: C01 [X(C28H18)]
dipole: -0.1456102 -0.0412426 -0.0051399 debye
polarizability: 483.9273711|-23.9309267|367.913283|-0.8429425|2.0369584|182.1046529 unknown
InChI: InChI=1S/C28H18/c1-2-9-21-17-23(14-13-19(21)7-1)28-25-12-6-4-10-22(25)18-27-24-11-5-3-8-20(24)15-16-26(27)28/h1-18H
charge 0 multiplicity 1
46 atoms
C  -0.075237 0.599176 -0.15595
C  1.042514 -0.282697 -0.119395
C  2.394167 0.242707 0.04084
C  0.114272 2.013814 -0.038683
C  1.462495 2.534763 0.120418
C  3.532292 -0.692936 0.076858
C  -1.465251 0.05369 -0.332134
C  2.561634 1.636375 0.1560
C  3.286962 -2.106428 -0.048557
C  0.85883 -1.718021 -0.241267
C  1.928566 -2.585771 -0.20744
C  -0.981508 2.948203 -0.072681
C  -2.255013 -0.296081 0.770114
C  1.65549 3.955276 0.239098
C  -2.009197 -0.102695 -1.654355
C  -3.586491 -0.803136 0.607953
C  4.883955 -0.262272 0.231905
C  -4.125117 -0.955267 -0.728913
C  4.37893 -3.024696 -0.015657
C  -3.301483 -0.593337 -1.845794
C  -0.758861 4.3189 0.04421
C  0.57288 4.830592 0.202137
C  5.947095 -1.178798 0.262207
C  5.696849 -2.573287 0.137652
C  -4.404414 -1.162696 1.730475
C  -5.458047 -1.459089 -0.890665
C  -5.699733 -1.650619 1.54278
C  -6.231553 -1.799953 0.221351
H  3.561076 2.06683 0.277587
H  -0.158919 -2.101619 -0.360226
H  1.768195 -3.666622 -0.300648
H  -1.851156 -0.18008 1.783403
H  -1.999631 2.56398 -0.190912
H  -1.388228 0.172559 -2.514074
H  2.676015 4.338441 0.359531
H  5.112461 0.803165 0.330817
H  4.16898 -4.096682 -0.11272
H  -3.702456 -0.706834 -2.860296
H  -1.603621 5.016162 0.016131
H  0.730188 5.910988 0.292956
H  6.974321 -0.817179 0.382472
H  6.528742 -3.285499 0.16186
H  -3.996676 -1.047654 2.742005
H  -5.862714 -1.572781 -1.903737
H  -6.316697 -1.92181 2.406571
H  -7.249207 -2.18368 0.088969
