program: Gaussian 09
title: 000253359
version: EM64L-G09RevD.01
frameworkgroup: C1[X(C11H8N4O2)]
method: RPBEPBE
basis: SDD
operation: Freq
keyword: #p
keyword: freq=noraman
keyword: PBEPBE/SDD
title: #p freq=noraman PBEPBE/SDD
converged: YES YES NO NO
title: Mulliken charges:
elementType: O O N N N N C C C C C C C C C C C H H H H H H H H
charge: -0.249615 -0.219174 -0.215355 -0.250882 -0.096966 -0.431899 0.154982 0.083264 0.448360 -0.254541 0.150750 -0.340194 -0.412244 0.039600 -0.218873 -0.204151 -0.243792 0.341225 0.298999 0.335811 0.216129 0.356580 0.239635 0.234203 0.238148
chargesum: 0.00000
title: Mulliken charges with hydrogens summed into heavy atoms:
elementType: O O N N N N C C C C C C C C C C C
charge: -0.249615 -0.219174 -0.215355 0.090343 -0.096966 -0.075319 0.154982 0.083264 0.448360 0.044458 0.150750 -0.004383 -0.196115 0.039600 0.020762 0.030052 -0.005644
polarizability: 2.49712589e+02 6.71848264e+00 1.81674657e+02 -1.44529852e+00 -3.06310323e+00 6.02865493e+01
1716.lowfreq: -11.4793 -6.2133 0.0004 0.0006 0.0007 4.4010 38.4179 49.9011 102.8184
frequency: 38.4039 49.8620 102.8165 127.8613 163.0639 185.6716 244.2122 275.2519 279.8430 322.1713 353.4427 369.6741 405.0277 423.4236 470.0217 498.3826 545.7513 547.9049 609.8130 627.2113 642.7382 665.8440 687.8201 692.5662 710.5698 746.1600 760.8779 780.2506 819.0677 834.3558 855.5090 915.8532 921.6850 957.9517 976.0503 983.7990 1006.6489 1026.4150 1061.9642 1072.9300 1095.5538 1128.3731 1177.7968 1183.5481 1203.1359 1241.6175 1290.4893 1337.5890 1340.6346 1343.4542 1373.5938 1382.0394 1445.7008 1457.1532 1493.2588 1531.2876 1591.9751 1602.4852 1615.4297 1634.2847 1645.3481 3126.3829 3141.9561 3152.8437 3165.7585 3175.2665 3241.7902 3517.5211 3594.5873
redmass: 4.0705 7.6082 6.2366 7.3351 8.9132 5.8025 5.1376 8.9612 7.4734 6.7942 7.1124 1.3701 2.9092 6.8563 8.3135 3.4079 5.4958 4.1939 6.6528 7.4108 3.9575 5.3941 6.8467 2.0517 5.0751 2.6158 1.6914 2.3529 7.8647 1.2620 1.5615 1.4347 5.2043 5.6822 1.3622 5.4211 1.3468 2.4737 2.3818 3.3117 1.6853 3.8315 1.1207 2.5511 1.2301 3.0662 2.3537 1.4225 4.6399 1.6000 6.3508 7.5045 2.3684 2.3029 2.5624 7.3944 6.4639 6.5715 6.6133 11.0630 6.8124 1.0874 1.0879 1.0930 1.0961 1.1016 1.1008 1.0769 1.0822
irintensity: 1.5133 0.3563 3.4170 1.1115 11.2906 3.5334 2.3239 3.0762 3.9433 3.1802 6.0514 231.8406 0.1536 4.0391 6.5112 11.7697 8.2186 6.2652 0.6276 1.8377 1.5820 13.7061 28.1202 40.0070 0.8837 13.7484 64.6169 149.3630 1.6635 3.1782 17.1148 9.3536 10.7476 4.9292 2.0549 0.1388 3.3425 6.4537 54.8500 35.2034 13.4763 279.2159 5.7588 75.5243 12.9631 27.0874 46.6121 12.9567 3.0059 3.0344 148.0946 26.8695 29.7674 23.5834 161.9377 109.5673 0.9361 605.0634 363.4454 139.1294 392.8321 11.5203 2.9404 22.6943 0.5639 32.9008 10.5964 55.2428 118.4777
temp: 298.150 k
press: 1.00000 atm
elementType: 8 8 7 7 7 7 6 6 6 6 6 6 6 6 6 6 6 1 1 1 1 1 1 1 1
symmnumber: 1
zpe: 472463.5 jmol-1
zpe.correction: 0.179952 hartree
zpe.thermalcorrener: 0.192966 hartree
zpe.thermalcorrenthalpy: 0.193911 hartree
zpe.thermalcorrgfe: 0.139653 hartree
zpe.sumelectzpe: -792.247534 hartree
zpe.sumelectthermal: -792.234519 hartree
zpe.sumelectthermalent: -792.233575 hartree
zpe.sumelectthermalfe: -792.287833 hartree
dipole: -7.0915 -6.5101 -0.8070
dipole: 9.6604
quadrupole: -100.4597 -96.2866 -100.0749
quadrupole: 1.7017 -0.6434 -0.2799
quadrupole: -1.5193 2.6538 -1.1345 1.7017 -0.6434 -0.2799
hfenergy: -792.4274854 hartree
pointgroup: C01 [X(C11H8N4O2)]
dipole: 2.755449 2.5821196 -0.4305433 debye
dipolederiv: -1.2062464 0.3594235 -0.0019543 0.4484677 -0.724302 0.0157529 0.000825 0.0167622 -0.3722245 -0.7495064 -0.2842323 0.0304792 -0.4215769 -1.3200174 0.0856791 0.049989 0.0809698 -0.3818699 -1.3276618 -0.2652446 0.0498057 0.3096031 -0.0444131 -0.0086669 0.1302119 0.0182207 -0.0463593 -0.8956017 -0.6096846 -0.0127449 -0.7440612 -0.3091606 -0.0202108 -0.3243011 -0.1872974 -0.1816843 -1.212701 -0.5078738 0.0607059 -0.8842149 -1.1668908 0.0914252 0.1551175 0.1062998 -0.2781626 -0.7000987 0.2430229 -0.0108437 0.5053363 -1.1852934 0.0523435 -0.0290976 0.0585065 -0.3434495 0.6999511 0.0681403 -0.0315328 0.9881755 1.2633357 -0.1091809 -0.0341167 -0.0796658 0.1364821 -0.6067438 0.1157913 0.0026639 -0.5267315 -0.6843783 0.0659038 0.0619549 0.0732614 -0.0448572 1.3037622 -0.0076328 0.0350871 -0.4851195 0.047674 0.0263408 0.031888 -0.0039374 0.0788533 0.6333822 0.6023467 -0.0311432 0.5907152 0.3292149 -0.0257463 -0.0020184 0.0316295 -0.0265669 1.6472346 -0.1624184 -0.033396 -0.3911331 1.3382056 -0.0785929 -0.0273259 -0.1007815 0.2609845 -0.3016014 0.0501759 0.008455 0.2361426 -0.0819815 0.0122497 -0.0302505 -0.0160764 -0.1289748 -0.2340218 -0.0041502 -0.0020452 -0.098433 -0.0402549 0.0482995 -0.0120165 0.0809295 -0.1875837 2.041994 0.3626339 -0.0756112 0.3158517 1.8351568 -0.1296647 -0.1183867 -0.1355262 0.2807845 0.1101226 -0.0325447 0.0105016 -0.0772208 0.1801036 0.0497052 0.0065515 0.0380215 -0.1236695 0.0425909 0.0404125 0.0249043 0.1925686 0.0662945 0.0467662 0.0551183 0.0465256 -0.1272421 -0.0570715 -0.0631024 0.0092207 -0.1337507 -0.0916907 -0.0000213 -0.0226787 0.0018361 -0.1595169 0.2746143 0.0107653 0.0271212 0.0790859 0.3125384 -0.002825 0.1600214 0.0823006 0.3211149 0.1265841 -0.0056072 -0.0008282 -0.005451 0.0841555 0.0117529 -0.0010228 -0.0027433 0.1934659 0.2021601 -0.0490418 -0.0270304 -0.0389186 0.0987079 -0.0125889 -0.0413122 0.0010308 0.1707457 0.099581 0.0935349 0.0038178 0.0772068 -0.0815813 -0.0480795 0.0193155 -0.049246 0.1586159 0.184282 0.0442264 0.0036274 0.0442271 0.1623476 0.0127466 0.0027002 0.0118629 0.3371017 0.0640598 0.0258268 0.0000025 0.0625683 -0.0717514 -0.0352391 0.0113525 -0.0301966 0.1490579 -0.0365322 -0.0841458 -0.0297093 -0.1056482 0.0059221 -0.0369394 -0.0344286 -0.0348493 0.1495861 -0.1025322 0.0593781 -0.009553 0.0623106 0.0780588 -0.01121 -0.0080901 -0.0078372 0.1653685 unknown
polarizability: 249.5436503|7.5902902|181.9131619|-0.1504785|-1.4067662|60.2169833 unknown
InChI: InChI=1S/C11H8N4O2/c16-10-8-6-12-15(7-4-2-1-3-5-7)9(8)13-11(17)14-10/h1-6,12,14H
charge 0 multiplicity 1
25 atoms
O  -4.192901 1.332247 0.011814
O  -2.466089 -3.01063 0.274135
N  0.493594 0.715159 -0.114959
N  0.184741 2.090305 -0.191972
N  -0.85201 -1.308543 0.074835
N  -3.251403 -0.822422 0.142155
C  -0.728187 0.014307 -0.030218
C  -1.777262 1.015144 -0.069662
C  1.846137 0.260596 -0.041878
C  -1.182043 2.26279 -0.196475
C  -3.174816 0.580763 0.027365
C  2.125764 -1.116791 -0.238886
C  2.895685 1.18085 0.217955
C  -2.170884 -1.791837 0.171809
C  3.465382 -1.553461 -0.197379
C  4.229932 0.722743 0.244035
C  4.523377 -0.643267 0.031685
H  0.900565 2.736492 -0.52052
H  -1.629696 3.249914 -0.286129
H  1.296665 -1.812758 -0.391297
H  2.695398 2.233351 0.449838
H  -4.189496 -1.230627 0.215022
H  3.678945 -2.616998 -0.346707
H  5.03699 1.434366 0.447991
H  5.560009 -0.994191 0.057142
