program: Gaussian 09
title: 000253355
version: EM64L-G09RevD.01
frameworkgroup: C1[X(C12H10N4O)]
method: RPBEPBE
basis: SDD
operation: Freq
keyword: #p
keyword: freq=noraman
keyword: PBEPBE/SDD
title: #p freq=noraman PBEPBE/SDD
converged: YES YES NO NO
title: Mulliken charges:
elementType: O N N N N C C C C C C C C C C C C H H H H H H H H H H
charge: -0.210642 -0.411422 0.069174 0.000833 -0.002700 0.278324 0.416814 0.186677 -0.281287 -0.310388 -0.281409 -0.359202 -0.454167 -0.320479 -0.325414 -0.179400 -0.324716 0.272925 0.224735 0.291272 0.207152 0.292894 0.240293 0.249901 0.246315 0.236723 0.247194
chargesum: 0.00000
title: Mulliken charges with hydrogens summed into heavy atoms:
elementType: O N N N N C C C C C C C C C C C C
charge: -0.210642 -0.118528 0.069174 0.000833 -0.002700 0.278324 0.416814 0.186677 -0.008362 -0.085652 0.009864 -0.152050 -0.213874 -0.070578 -0.079100 0.057323 -0.077522
polarizability: 3.30946672e+02 5.45521920e+00 1.57487682e+02 -4.32075206e+00 -8.84806505e-01 6.83152186e+01
1716.lowfreq: -6.3827 -0.0008 -0.0008 -0.0006 3.1692 6.3106 29.3113 34.8416 44.3419
frequency: 29.0610 34.7309 44.3347 64.5640 116.4130 128.9228 183.5137 227.7641 230.7501 253.2877 310.5604 362.3269 368.2659 389.6295 420.3981 460.0673 511.5801 521.5207 606.6516 635.5399 659.4899 663.3979 670.2092 690.9559 716.9688 752.5992 824.1934 824.7328 838.3928 890.0392 898.1412 906.8793 940.2389 957.6349 958.0170 965.9331 987.9155 1001.1347 1007.4927 1026.3811 1028.7471 1061.9125 1087.0158 1107.4717 1130.8344 1198.3896 1218.9001 1240.2578 1249.3823 1299.7298 1312.5621 1323.7043 1327.9897 1350.9354 1399.4394 1406.7322 1460.2106 1464.8150 1507.3426 1542.3473 1547.0653 1576.9859 1585.2427 1587.0397 1623.6548 2970.6951 3107.4798 3125.4583 3136.9474 3143.4975 3150.1975 3155.7819 3174.2774 3174.9086 3383.9543
redmass: 4.6434 5.1621 6.2896 5.9951 6.0728 5.7749 6.6639 3.6944 5.8946 4.3221 4.4175 3.3609 4.3715 3.1709 5.7977 6.6075 4.6769 4.1065 7.9506 1.2992 6.0944 5.9701 7.1396 4.5193 1.9006 2.8846 1.6626 4.3826 1.7919 1.2638 5.6036 1.4044 1.4497 2.3818 1.9775 1.7845 1.4469 3.6904 1.3712 3.4049 5.2149 2.1535 1.6428 1.7675 3.0030 1.3675 1.3395 2.4047 1.9019 6.8420 6.7836 1.6760 1.4723 1.3567 1.8575 2.1048 1.8910 2.1514 1.8991 5.6978 7.3495 5.5465 5.3519 6.2881 8.4421 1.0870 1.0910 1.0878 1.0888 1.0897 1.0973 1.0920 1.1002 1.0967 1.0752
irintensity: 0.2138 0.1556 1.7602 7.3470 7.9066 5.1791 11.1277 13.5906 4.9736 7.2087 3.1386 0.2118 1.4152 1.6046 6.7454 4.7869 4.3956 3.0305 3.3786 72.7163 1.8755 12.4085 35.1675 24.7875 42.3025 11.8153 23.2051 13.6613 30.9140 3.7993 13.9608 2.5574 22.5654 5.7466 10.6953 0.6005 2.6999 18.2336 1.5247 5.0505 1.8139 20.5394 27.8769 25.8588 153.7228 0.0414 34.1410 158.0795 164.7549 0.1282 1.6370 5.0006 12.1742 10.1590 18.7183 24.3027 26.6809 34.8012 269.4303 6.0943 34.6290 17.1746 13.4760 8.9340 168.7416 51.4150 23.1703 10.0182 5.3909 28.3796 13.8540 13.0357 17.2259 5.5542 6.9826
temp: 298.150 k
press: 1.00000 atm
elementType: 8 7 7 7 7 6 6 6 6 6 6 6 6 6 6 6 6 1 1 1 1 1 1 1 1 1 1
symmnumber: 1
zpe: 527807.6 jmol-1
zpe.correction: 0.201031 hartree
zpe.thermalcorrener: 0.215123 hartree
zpe.thermalcorrenthalpy: 0.216067 hartree
zpe.thermalcorrgfe: 0.157661 hartree
zpe.sumelectzpe: -756.278793 hartree
zpe.sumelectthermal: -756.264701 hartree
zpe.sumelectthermalent: -756.263757 hartree
zpe.sumelectthermalfe: -756.322163 hartree
dipole: -0.3504 -2.0400 -0.3236
dipole: 2.0950
quadrupole: -115.7782 -95.1367 -100.7852
quadrupole: -9.4422 -3.6129 -2.3086
quadrupole: -11.8782 8.7633 3.1148 -9.4422 -3.6129 -2.3086
hfenergy: -756.4798244 hartree
pointgroup: C01 [X(C12H10N4O1)]
dipole: -0.1421222 0.8062043 0.0959457 debye
polarizability: 330.9020369|-4.5017988|157.2524811|6.597203|-4.2485464|68.5950545 unknown
InChI: InChI=1S/C12H10N4O/c17-12(11-3-6-13-7-4-11)16-15-9-10-2-1-5-14-8-10/h1-9,16H
charge 0 multiplicity 1
27 atoms
O  1.377437 -2.024673 -0.091339
N  0.545082 0.168683 0.058186
N  -0.774536 -0.228641 -0.018502
N  5.659612 0.764309 0.072153
N  -5.449555 1.131404 0.141162
C  2.968115 -0.193086 0.003432
C  -3.120269 0.347163 0.04954
C  1.579316 -0.784702 -0.024495
C  4.027091 -1.02178 0.450262
C  3.288266 1.119882 -0.429829
C  -3.567696 -0.987516 -0.169794
C  -1.699346 0.697814 0.126927
C  -4.107387 1.361372 0.197466
C  5.339798 -0.504589 0.472952
C  4.634965 1.547163 -0.37759
C  -4.950466 -1.238072 -0.229672
C  -5.853739 -0.156435 -0.070459
H  3.811649 -2.048155 0.761392
H  2.533103 1.796739 -0.845723
H  -2.827656 -1.785495 -0.285304
H  -1.457305 1.765337 0.309704
H  0.7869 1.154848 0.239198
H  -3.810426 2.404706 0.369204
H  6.177846 -1.118106 0.820644
H  4.915311 2.551784 -0.713364
H  -5.33321 -2.249762 -0.395904
H  -6.9370 -0.315994 -0.111849
