program: Gaussian 09
title: 000253340
version: EM64L-G09RevD.01
frameworkgroup: C1[X(C12H19NO5)]
method: RPBEPBE
basis: SDD
operation: Freq
keyword: #p
keyword: freq=noraman
keyword: PBEPBE/SDD
title: #p freq=noraman PBEPBE/SDD
converged: YES YES NO NO
title: Mulliken charges:
elementType: O O O O O N C C C C C C C C C C C C H H H H H H H H H H H H H H H H H H H
charge: -0.455715 -0.260771 -0.262739 -0.247245 -0.257799 -0.057126 -0.201505 -0.178662 -0.196244 -0.213488 -0.501917 -0.491349 -0.179557 -0.651024 0.205821 0.185787 -0.507219 -0.501584 0.255308 0.266415 0.293055 0.296328 0.230161 0.259396 0.220921 0.233488 0.247375 0.198385 0.231479 0.232604 0.364947 0.233100 0.246879 0.235849 0.235761 0.245553 0.245332
chargesum: 0.00000
title: Mulliken charges with hydrogens summed into heavy atoms:
elementType: O O O O O N C C C C C C C C C C C C
charge: -0.090769 -0.260771 -0.262739 -0.247245 -0.257799 -0.057126 0.053804 0.087753 0.096810 0.082840 -0.012360 -0.036939 0.067818 0.011445 0.205821 0.185787 0.208609 0.225062
polarizability: 1.78793744e+02 -3.79257996e+00 1.44037823e+02 -5.35610888e+00 -2.62605378e+00 1.17739988e+02
1716.lowfreq: -0.0005 -0.0004 0.0006 0.6413 7.4659 13.3778 29.0021 34.5170 64.9682
frequency: 28.9750 34.4560 64.9644 92.3462 93.8094 108.1921 111.3820 124.7246 138.3233 166.7883 193.5265 197.1931 209.1549 216.5692 239.5422 252.5097 267.4133 296.4099 325.2431 345.5633 371.0178 391.5233 416.0689 490.7264 523.8426 546.6040 583.4560 614.2628 670.4510 701.1755 718.5421 722.7659 753.9912 786.9600 827.1521 844.3782 854.8817 858.8732 907.8384 948.5919 954.9329 969.7145 986.4040 1004.1163 1019.8972 1038.0891 1040.8651 1083.5738 1102.5265 1106.0027 1112.6666 1112.7925 1124.7369 1127.6030 1148.7611 1149.1597 1164.3191 1172.9260 1181.0915 1191.8623 1212.2939 1233.1131 1242.8835 1257.5335 1271.4281 1276.5267 1288.1069 1298.9103 1310.9513 1326.4939 1341.0124 1349.4731 1404.0449 1420.8347 1421.8873 1432.0470 1452.1890 1452.9414 1462.8206 1463.8007 1467.6157 1470.0041 1484.0049 1491.1966 1604.3762 1633.6615 2892.3198 2977.3576 2993.5997 3004.2641 3007.9423 3009.0357 3019.8444 3029.4952 3052.2463 3060.1756 3069.9418 3077.8796 3084.6437 3086.8121 3106.1867 3113.4739 3149.2962 3153.7079 3488.6405
redmass: 4.9619 5.3326 5.5208 2.3931 1.8851 1.7586 1.1933 3.4171 3.9899 3.3125 3.3963 1.7514 1.9362 2.3673 4.0346 4.3828 3.6541 3.8070 4.6643 3.8195 6.0782 6.0709 4.2730 4.1215 3.3975 1.1369 3.5076 3.7469 5.6739 5.1204 4.2042 5.0273 4.3666 2.5160 4.7822 5.3306 2.0097 2.9714 5.9608 4.8768 3.3992 2.1719 4.4198 4.0809 2.3217 2.2890 2.8731 2.2150 1.8571 1.6998 1.2727 1.2678 2.0933 1.8877 1.4500 1.4557 1.4878 2.2898 1.8029 1.9541 1.5568 1.2642 1.5343 1.5690 1.4242 1.3625 1.4269 1.3229 1.3882 1.5793 1.5585 1.3140 1.5819 1.2027 1.1945 1.1598 1.0502 1.0500 1.0514 1.0505 1.0616 1.0662 1.0533 1.0864 9.0573 8.9434 1.0528 1.0818 1.0823 1.0295 1.0594 1.0293 1.0636 1.0769 1.0875 1.1023 1.0851 1.0931 1.1003 1.1010 1.1044 1.1048 1.1048 1.1053 1.0649
irintensity: 2.4557 1.3395 2.4792 0.2294 0.5715 0.3160 0.2106 0.1079 2.7980 1.2180 4.8447 1.4491 1.6459 5.8794 0.5775 2.0608 15.3758 2.9939 34.5516 2.5671 10.1489 4.6937 3.0959 17.4810 5.4084 177.5177 20.1231 12.1045 2.0111 17.4967 1.9644 5.2504 6.8512 19.4722 4.8198 5.3448 2.9877 1.4580 11.2092 44.7655 29.1247 1.3501 2.9901 56.0454 31.1229 2.3984 1.6890 30.4331 19.0615 8.3595 1.1949 0.7831 129.6044 171.0824 33.9153 3.3417 24.6398 239.6179 46.3078 10.6500 6.8090 10.0231 106.5442 40.3994 16.4867 43.9867 2.9107 4.0490 8.1643 27.7812 7.3987 17.6726 35.2208 26.2728 18.6500 5.7025 14.1952 14.3031 10.4698 11.3458 8.5893 9.9674 3.3507 33.7963 145.4069 146.3840 100.5345 13.6461 17.4979 37.4774 23.2126 29.9453 32.2290 45.6821 27.2035 2.8468 5.8180 2.6660 37.8686 41.7981 25.2472 21.9140 17.0320 13.6021 51.6390
temp: 298.150 k
press: 1.00000 atm
elementType: 8 8 8 8 8 7 6 6 6 6 6 6 6 6 6 6 6 6 1 1 1 1 1 1 1 1 1 1 1 1 1 1 1 1 1 1 1
symmnumber: 1
zpe: 797186.9 jmol-1
zpe.correction: 0.303632 hartree
zpe.thermalcorrener: 0.322406 hartree
zpe.thermalcorrenthalpy: 0.323350 hartree
zpe.thermalcorrgfe: 0.256214 hartree
zpe.sumelectzpe: -898.116908 hartree
zpe.sumelectthermal: -898.098135 hartree
zpe.sumelectthermalent: -898.097191 hartree
zpe.sumelectthermalfe: -898.164327 hartree
dipole: -1.9769 3.2869 0.6559
dipole: 3.8913
quadrupole: -79.9398 -107.6622 -112.8528
quadrupole: 1.9904 -2.0592 1.2106
quadrupole: 20.2118 -7.5106 -12.7012 1.9904 -2.0592 1.2106
hfenergy: -898.4205408 hartree
pointgroup: C01 [X(C12H19N1O5)]
dipole: -0.7477799 -1.3001282 -0.3071262 debye
polarizability: 178.6375102|4.3968182|144.3972398|5.3410786|-1.44843|117.5368049 unknown
InChI: InChI=1S/C12H19NO5/c1-13-6-4-5-7(13)9(12(16)18-3)10(14)8(6)11(15)17-2/h6-10,14H,4-5H2,1-3H3
charge 0 multiplicity 1
37 atoms
O  0.207511 2.092202 1.003825
O  3.661669 0.566415 0.593579
O  -3.592238 0.115107 0.054414
O  2.553729 1.19637 -1.352637
O  -2.470778 2.144362 0.011541
N  -0.015443 -2.012183 0.735438
C  1.120012 -1.440985 -0.055054
C  -1.197421 -1.372213 0.076601
C  1.32579 0.025488 0.456079
C  -1.227106 0.091623 0.599279
C  0.654903 -1.499045 -1.554863
C  -0.907822 -1.448398 -1.465594
C  0.062091 0.871887 0.205326
C  -0.057372 -3.493191 0.738752
C  2.527811 0.672462 -0.213576
C  -2.451192 0.897045 0.188099
C  4.904193 1.150295 0.031556
C  -4.842402 0.844095 -0.283905
H  2.041181 -2.018364 0.132837
H  -2.127553 -1.886323 0.364162
H  1.512773 -0.027881 1.541285
H  -1.242749 0.030051 1.707502
H  0.99375 -2.440875 -2.021173
H  1.073416 -0.666655 -2.145659
H  -1.332377 -0.586892 -2.011124
H  -1.363242 -2.358175 -1.894117
H  0.013921 1.13822 -0.871005
H  -0.122364 -3.961236 -0.272438
H  -0.930137 -3.827228 1.326863
H  0.850617 -3.877855 1.235608
H  -0.55478 2.682784 0.755342
H  5.668094 0.978808 0.802674
H  4.762757 2.227445 -0.157366
H  5.170802 0.649577 -0.914651
H  -5.612909 0.063207 -0.342677
H  -4.72721 1.367669 -1.247242
H  -5.076327 1.579886 0.503224
