program: Gaussian 09
title: 000253319
version: EM64L-G09RevD.01
frameworkgroup: C1[X(C8H10O2)]
method: RPBEPBE
basis: SDD
operation: Freq
keyword: #pfreq=noraman
keyword: PBEPBE/SDD
title: #p freq=noraman PBEPBE/SDD
converged: YES YES NO NO
title: Mulliken charges:
elementType: O O C C C C C C C C H H H H H H H H H H
charge: -0.240614 -0.233713 -0.287560 -0.223546 -0.220419 -0.235698 -0.061420 -0.461142 -0.449205 -0.002250 0.266244 0.259105 0.256134 0.273412 0.273372 0.220965 0.217372 0.212137 0.231495 0.205334
chargesum: 0.00000
title: Mulliken charges with hydrogens summed into heavy atoms:
elementType: O O C C C C C C C C
charge: -0.240614 -0.233713 -0.021316 0.035559 0.035715 0.037713 0.211952 -0.022805 -0.005574 0.203084
polarizability: 9.67868349e+01 -3.56945088e-01 7.78109919e+01 -1.71179924e+00 -2.50230001e+00 7.02357088e+01
1716.lowfreq: -0.0010 -0.0004 -0.0004 9.4120 16.0224 22.2892 43.5652 128.1414 187.9105
frequency: 43.3658 128.0721 187.9007 255.3094 358.4274 406.7594 444.5118 478.2675 642.0748 667.4574 732.3179 794.1571 795.5976 806.9932 877.5192 893.4307 906.3173 909.9575 922.8100 934.4646 959.2897 976.7452 984.1192 1017.3060 1031.2869 1047.2122 1061.6658 1070.6629 1096.2869 1127.0550 1128.3870 1188.1757 1229.1006 1243.6176 1256.8333 1261.2911 1285.9858 1309.1487 1330.3886 1344.5030 1352.3570 1462.0684 1482.4510 1617.7637 3008.6459 3016.5445 3029.7166 3053.6958 3071.0275 3083.6606 3120.8774 3175.3166 3182.5085 3202.6023
redmass: 6.8132 4.7905 3.4173 4.6751 3.0805 2.0141 2.1911 3.8023 4.5848 5.9822 4.9228 1.6881 4.1243 1.9105 2.9846 3.4265 1.9961 2.0769 2.2104 1.8764 1.5954 2.2040 1.6583 1.3408 1.9446 1.3256 1.2350 1.4618 8.3941 1.2794 1.2572 2.0429 1.9169 1.4714 1.3851 2.1038 1.5880 1.6960 1.3615 1.2678 2.0653 1.0932 1.0961 8.8691 1.0594 1.0602 1.0912 1.0870 1.1051 1.1052 1.0919 1.0922 1.0929 1.1010
irintensity: 1.6018 2.3048 4.6867 10.6811 13.9327 0.4948 1.7025 4.9297 1.1819 3.3867 2.2095 16.9840 5.3263 26.3343 5.1960 16.6073 3.2700 12.4671 0.7545 11.2421 3.5164 13.8438 1.1323 3.5051 5.3476 9.3551 3.0570 5.2870 339.8957 0.1964 4.1781 0.6302 3.6834 0.2122 0.5780 2.1699 10.7369 6.7321 23.6141 1.5680 11.6714 10.6970 6.5103 281.1381 48.0350 40.5412 62.4023 9.6422 29.8057 27.8206 17.5270 7.6281 8.7258 17.8607
temp: 298.150 k
press: 1.00000 atm
elementType: 8 8 6 6 6 6 6 6 6 6 1 1 1 1 1 1 1 1 1 1
symmnumber: 1
zpe: 430619.8 jmol-1
zpe.correction: 0.164014 hartree
zpe.thermalcorrener: 0.172003 hartree
zpe.thermalcorrenthalpy: 0.172948 hartree
zpe.thermalcorrgfe: 0.130612 hartree
zpe.sumelectzpe: -460.502031 hartree
zpe.sumelectthermal: -460.494042 hartree
zpe.sumelectthermalent: -460.493098 hartree
zpe.sumelectthermalfe: -460.535434 hartree
dipole: 2.2282 -0.9446 0.1615
dipole: 2.4256
quadrupole: -61.5879 -59.8010 -56.4847
quadrupole: 5.8357 -2.0447 0.6687
quadrupole: -2.2967 -0.5099 2.8065 5.8357 -2.0447 0.6687
hfenergy: -460.6660452 hartree
pointgroup: C01 [X(C8H10O2)]
dipole: -0.8828199 0.2904897 0.2165813 debye
dipolederiv: -1.6962197 0.0798802 0.0446467 0.0836512 -0.4619326 -0.0882095 -0.1382433 -0.0682205 -0.3023783 -0.7757031 0.0555103 0.0228581 0.5349494 -0.6291841 -0.183647 0.3001871 -0.1993803 -0.4303921 -0.2440761 -0.0960596 0.0696516 -0.0914857 -0.0202434 0.0469886 0.0634972 0.0623908 -0.0054876 0.019253 -0.0529165 -0.0552394 -0.0501251 -0.0395976 -0.0647933 -0.1206079 -0.0702257 0.0145802 0.0922431 0.0270754 0.0167512 0.0582463 0.055093 -0.0266522 0.0403513 -0.0388432 -0.1111932 -0.0215215 -0.0200589 -0.0120479 -0.0286719 0.0089515 0.0039669 -0.07355 0.0385961 0.0139263 0.9170205 0.1053786 0.0233166 0.2207345 0.213035 0.0533298 0.3015827 0.006985 0.261289 -0.0216173 0.0227833 -0.1013746 0.0051908 0.0949644 -0.007149 -0.0533246 -0.0061648 0.0973556 0.075608 0.0859114 0.0290072 0.0762084 0.0349844 -0.0643886 0.0180056 -0.0566399 0.0227697 1.7648262 -0.2059423 -0.0464713 -0.7013817 0.7793293 0.3736762 -0.2576613 0.3640823 0.3897386 0.0487181 0.0063491 0.0215355 0.0213975 -0.0367574 0.099053 0.0322202 0.0961497 0.0590076 -0.0637119 0.0313898 -0.1080246 0.0312036 0.0356625 0.0129852 -0.105099 0.0075997 0.0546179 0.0263009 0.1073137 0.0332879 0.1121328 -0.010512 -0.0463646 0.0393246 -0.037206 0.0235463 -0.0103877 0.1020592 -0.0359789 0.0894557 -0.0200524 0.0339912 -0.0257303 0.0285025 0.0565404 -0.0538109 -0.0006289 0.0713467 -0.0425971 0.0462781 -0.060566 0.0007321 -0.0367736 -0.0656127 0.0690439 0.0530074 0.0651402 0.0128334 0.0060755 -0.0787481 0.0265923 -0.1176911 -0.1158718 -0.0367365 -0.1092259 0.0488366 -0.0981989 -0.0632332 0.0446392 0.0735167 0.1057794 0.0320855 -0.0159026 -0.0739173 0.1012831 -0.076799 -0.0099751 0.1297274 0.0704022 0.0743824 -0.0294224 0.0008466 -0.0519686 -0.134738 -0.0512489 0.0325112 -0.0712036 -0.0972371 -0.0429953 -0.0231016 -0.0741728 -0.0659404 -0.0537866 -0.1054952 -0.0153971 -0.1066355 -0.0949585 -0.1103274 0.0580026 unknown
polarizability: 96.888298|0.4501211|75.6842697|0.0581335|4.2675857|72.260968 unknown
InChI: InChI=1S/C8H10O2/c9-3-10-8-4-1-5-6(2-4)7(5)8/h3-8H,1-2H2
charge 0 multiplicity 1
20 atoms
O  1.415926 0.924753 0.1660
O  3.053221 -0.593428 -0.560953
C  -0.9113 1.006006 -0.648295
C  -2.095322 0.005033 -0.648451
C  -1.734048 0.775779 0.642153
C  -0.251123 -0.99585 0.362544
C  0.33934 0.144802 -0.52549
C  -1.483931 -1.403568 -0.508033
C  -0.921201 -0.192528 1.520422
C  2.707137 0.437594 0.051008
H  -0.922073 1.942189 -1.20574
H  -3.010409 0.19917 -1.209639
H  -2.376363 1.554096 1.055713
H  0.448621 -1.795711 0.637696
H  0.746514 -0.229048 -1.481086
H  -1.192364 -1.846804 -1.477555
H  -2.14948 -2.11069 0.018618
H  -1.559462 -0.836536 2.151913
H  -0.185617 0.328212 2.157029
H  3.387535 1.12443 0.590544
